{"text_format":"1","workbook":"xlsx","n_sheets":12,"sheets":["general info","selection","physical parameters","configuration","summary","air velocities","instelwaarden & data","talen","velocity","noise","capacity","info"],"not_rendered":{"charts":5,"images":11,"macros":1,"external_links":1,"defined_names":25,"comments":6,"pivot_tables":0},"unopened":[],"bounds":{"document_bytes":16777216,"sheet_cells":100000,"rows_first":2000,"rows_last":500,"rows_between":2000,"halvings":0,"cell_chars":16384,"cell_head_chars":4096},"cells_cut":0,"cells_raw":0,"read":"whole","date_system":"1900"}

{"sheet":"general info","index":0,"n_rows":36,"n_cols":10,"rows_kept":36,"cut":false,"hidden":true,"merged":[[0,5,1,5],[1,1,1,4]]}
["General info",null,null,null,null,{"$f":"selection!F1","v":"EN"}]
[{"$f":"IF($F$1=\"NL\",talen!A2,IF($F$1=\"FR\",talen!B2,IF($F$1=\"EN\",talen!C2,talen!D2)))","v":"Project/Building:"},{"$f":"selection!B2","v":0}]
[{"$f":"IF($F$1=\"NL\",talen!A3,IF($F$1=\"FR\",talen!B3,IF($F$1=\"EN\",talen!C3,talen!D3)))","v":"Reference/ Room data:"}]
[{"$f":"IF($F$1=\"NL\",talen!A4,IF($F$1=\"FR\",talen!B4,IF($F$1=\"EN\",talen!C4,talen!D4)))","v":"# per room:"},{"$f":"selection!B4","v":0}]
[]
["Configuration"]
{"$rows_left_out":31}
{"sheet":"selection","index":1,"n_rows":51,"n_cols":61,"rows_kept":51,"cut":false,"hidden":false,"merged":[[42,5,43,5],[44,5,45,5],[10,4,10,6],[22,5,27,5],[29,5,34,5],[0,5,1,5],[1,1,1,4],[9,2,9,4],[16,1,16,2],[19,1,19,2]]}
["General info",null,null,null,null,"EN"]
[{"$f":"IF($F$1=\"NL\",talen!A2,IF($F$1=\"FR\",talen!B2,IF($F$1=\"EN\",talen!C2,talen!D2)))","v":"Project/Building:"}]
[{"$f":"IF($F$1=\"NL\",talen!A3,IF($F$1=\"FR\",talen!B3,IF($F$1=\"EN\",talen!C3,talen!D3)))","v":"Reference/ Room data:"}]
[{"$f":"IF($F$1=\"NL\",talen!A4,IF($F$1=\"FR\",talen!B4,IF($F$1=\"EN\",talen!C4,talen!D4)))","v":"# per room:"}]
[]
["Configuration"]
{"$rows_left_out":46}
{"sheet":"physical parameters","index":2,"n_rows":112,"n_cols":10,"rows_kept":112,"cut":false,"hidden":true,"merged":[[26,0,26,15],[20,3,20,4]]}
["Calculation of air density"]
["Constants"]
["Rd","specific gas constant for dry air","J/(kg.K)",287.05799999999999]
["Rv","specific gas constant for water vapor","J/(kg.K)",461.495]
["input data",null,null,"cooling","heating"]
["P","atmospheric pressure","Pa",101325,{"$f":"D6","v":101325},101325]
{"$rows_left_out":107}
{"sheet":"configuration","index":3,"n_rows":36,"n_cols":13,"rows_kept":36,"cut":false,"hidden":true,"merged":[[15,4,15,5],[4,1,4,2],[11,4,11,5],[12,4,12,5],[13,4,13,5],[14,4,14,5],[8,0,8,1],[26,4,26,5],[27,4,27,5],[28,4,28,5],[29,4,29,5],[30,4,30,5]]}
[{"$f":"IF('general info'!$F$1=\"NL\",talen!A8,IF('general info'!$F$1=\"FR\",talen!B8,IF('general info'!$F$1=\"EN\",talen!C8,talen!D8)))","v":"Choose nominal beam length:"},{"$f":"selection!G21","v":1800}]
[{"$f":"IF('general info'!$F$1=\"NL\",talen!A17,IF('general info'!$F$1=\"FR\",talen!B17,IF('general info'!$F$1=\"EN\",talen!C17,talen!D17)))","v":"Battery length:"},{"$f":"selection!F21","v":1800}]
[{"$f":"IF($F$1=\"NL\",talen!A18,IF($F$1=\"FR\",talen!B18,IF($F$1=\"EN\",talen!C18,talen!D18)))","v":"Nozzletyp:"},{"$f":"selection!F22","v":"D"},null,null,null," "]
[null,null,null,null,{"$f":"'general info'!B7","v":"Name"},{"$f":"'general info'!C7","v":"Mounting type"},{"$f":"'general info'!D7","v":"Model"},{"$f":"'general info'!E7","v":"Connection"},{"$f":"'general info'!F7","v":"Nozzle"},{"$f":"'general info'!G7","v":"Battery type"},{"$f":"'general info'!H7","v":"Options"},{"$f":"'general info'!I7","v":"Beam length"},{"$f":"'general info'!J7","v":"Battery length"}]
[{"$f":"IF('general info'!$F$1=\"NL\",talen!A45,IF('general info'!$F$1=\"FR\",talen!B45,IF('general info'!$F$1=\"EN\",talen!C45,talen!D45)))","v":"Order code:"},{"$f":"IF(B1>=B2,CONCATENATE(E5,LEFT(F5,1),G5,LEFT(H5,1),I5,LEFT(J5,1),LEFT(K5,1),L5,M5),\"Error  nom length\")","v":"KT6LDH-18001800"},null,null,{"$f":"'general info'!B8","v":"K"},{"$f":"'general info'!C8","v":"T: T-bar"},{"$f":"'general info'!D8","v":6},{"$f":"IF(selection!B13<130,'general info'!E8,IF('general info'!E8='instelwaarden & data'!C4,'instelwaarden & data'!C6,'instelwaarden & data'!C5))","v":"L: left connection"},{"$f":"'general info'!F8","v":"D"},{"$f":"'general info'!G8","v":"H: cooling & heating coil"},{"$f":"'general info'!H8","v":"- : None"},{"$f":"'general info'!I8","v":1800},{"$f":"'general info'!J8","v":1800}]
[]
{"$rows_left_out":31}
{"sheet":"summary","index":4,"n_rows":35,"n_cols":26,"rows_kept":35,"cut":false,"hidden":false,"merged":[[22,0,26,25],[27,24,27,25],[28,0,28,1],[28,2,28,8],[28,9,28,11],[28,12,28,19],[28,20,28,21],[28,22,28,24],[31,0,34,0],[31,7,34,7],[31,8,32,8],[31,1,32,3],[31,4,32,6],[29,2,29,8],[29,9,29,11],[29,12,29,25],[30,0,30,1],[30,2,30,25],[33,22,33,23],[33,24,33,25],[31,9,31,13],[31,14,31,21],[31,22,31,23],[31,24,31,25],[32,14,32,17],[32,18,32,21]]}
[]
[]
[]
[]
[]
[]
{"$rows_left_out":30}
{"sheet":"air velocities","index":5,"n_rows":35,"n_cols":23,"rows_kept":35,"cut":false,"hidden":false,"merged":[[29,11,29,16],[0,0,4,25],[6,0,6,1],[6,2,6,8],[6,9,6,11],[6,12,6,19],[6,20,6,21],[6,22,6,24],[7,2,7,8],[7,9,7,11],[7,12,7,25],[8,0,8,1],[8,2,8,25],[30,11,30,16],[31,11,31,16],[32,11,32,16],[33,11,33,16],[34,11,34,16]]}
[]
[]
[]
[]
[]
[]
{"$rows_left_out":30}
{"sheet":"instelwaarden & data","index":6,"n_rows":57,"n_cols":23,"rows_kept":57,"cut":false,"hidden":true,"merged":[[42,0,42,1],[35,0,35,3],[36,0,36,3],[37,0,37,3],[34,0,34,5]]}
["Type:","Length","aansluiting","Mounting \nType:","Perforation \nType","Installation","NozzleType:","UserID","type battery","extra's",null,null,null,null,null,null,null,null,null,null,"Français","English","Deutch"]
["None","None","None","None","None","None","None","None","C: Cooling only","- : None",null,null,null,null,null,null,null,"Tr","ºC","Ruimte temperatuur:","Température d'ambiance:","Room Air Temperature (Tr):","Raum-Temperatur:"]
["K60",600,"L: left connection","T: T-bar","2: Circular",null,"A","Arn Winand (arn.winand@grada.be)","H: cooling & heating coil","V: deflectoren",null,null,null,null,null,null,null,"Qp","m3/h","Toevoer (primair) lucht volume :","Débit d'air primaire:","Supply (Primary) Air Flow Rate:","Primärluft-Volumenstrom:"]
[null,900,"R: Right connection","S: Recessed","3: Square",null,"B","Gilbert Dumortier (gilbert.dumortier@grada.be)","E: cooling with electrical heating",null,null,null,null,null,null,null,null,"Tp","ºC","Toevoer (primair) lucht temp.:","Température d'air primaire:","Supply (Primary) Air Temperature (Tp):","Primärluft-Temperatur:"]
[null,1000,"G: left connection with 2 connections ( recommended @ Qp=130m³/h)","Z: Surface",null,null,"C","Koen Van Riet (koen.van.riet@grada.be)",null,null,null,null,null,null,null,null,null,"Twin","ºC","Inlaat water temperatuur:","Température d'eau d'entrée:","Water Inlet Temperature  (Twin):","Kaltwasser-Vorlauftemperatur:"]
[null,1100,"D: Right connection with 2 connections (recommended @ Qp=130m³/h)","V: Flush",null,null,"D","Steven Gobert (steven.gobert@grada.be)",null,null,null,null,null,null,null,null,null,"Qw","l/h","Water volume:","Débit d'eau:","Water Flow Rate :","Kaltwasser-Volumenstrom:"]
{"$rows_left_out":52}
{"sheet":"talen","index":7,"n_rows":86,"n_cols":4,"rows_kept":86,"cut":false,"hidden":true,"merged":[]}
["NL","FR","EN","DU"]
["Project/Gebouw:","Projet/ Construction:","Project/Building:","Projekt/ Gebäude:"]
["Referentie/ Kamer info:","Référence/ Info Chambre:","Reference/ Room data:","Referentz/ Raum info:"]
["# per Kamer:","# par chambre:","# per room:","# pro Zimmer:"]
["Kies het modeltype:","Sélectionnez le type de modèle:","Choose model type:","Wählen sie Ihr Modell Typ:"]
["Kies de modelspecificaties:","Sélectionnez les spécifications de modèle:","Choose model specifications:","Wählen sie Ihr Modell Spezifikationen:"]
{"$rows_left_out":81}
{"sheet":"velocity","index":8,"n_rows":146,"n_cols":145,"rows_kept":146,"cut":false,"hidden":true,"merged":[[18,11,18,20],[18,36,18,45],[18,72,18,81],[18,97,18,106],[18,123,18,132],[23,134,23,144],[37,46,37,47],[37,82,37,83],[37,133,37,134],[23,83,23,93],[41,0,41,1],[41,3,41,4],[45,0,45,1],[57,11,57,20],[57,36,57,45],[57,97,57,106],[57,123,57,132],[62,83,62,93],[62,134,62,144],[76,46,76,47],[76,82,76,83],[76,133,76,134],[57,72,57,81],[88,11,88,20],[88,36,88,45],[88,72,88,81],[88,97,88,106],[88,123,88,132],[93,134,93,144],[107,46,107,47],[107,82,107,83],[107,133,107,134],[93,83,93,93],[119,11,119,20],[119,36,119,45],[119,72,119,81],[119,97,119,106],[119,123,119,132],[124,134,124,144],[138,46,138,47],[138,82,138,83],[138,133,138,134],[124,83,124,93]]}
["X",{"$f":"selection!B18","v":4},"m",null,"Q prim",{"$f":"capacity!B4","v":86.4},"[m³/h]",null,null,null,null,null,null,null,null,null,"L1 @ 1,8m",{"$f":"B1+(B3-1.8)","v":4.9000000000000004},"m"]
["Y",{"$f":"selection!B19","v":4},"m",null,null,null,null,null,null,null,null,null,null,null,null,null,"L1 @ 2m",{"$f":"B1+(B3-2)","v":4.7},"m"]
["H",2.7,"m",null,null,null,null,null,null,null,null,null,null,null,null,null,"L2",{"$f":"B1+(B3-0.1)+0.5","v":7.1},"m",null,null,null,null,"length beam","[mm]",600,600,600,600,900,900,900,900,1000,1000,1000,1000,1100,1100,1100,1100,1200,1200,1200,1200,1500,1500,1500,1500,1800,1800,1800,1800,2100,2100,2100,2100,2400,2400,2400,2400,2700,2700,2700,2700,2950,2950,2950,2950]
["lengte batt",600,900,1000,1100,1200,1500,1800,2100,2400,2700,2950,"[mm]","Nozzle","inductie",null,"L3 @ 1,8m",{"$f":"B2+(B3-1.8)","v":4.9000000000000004},"m",null,"A",2,null,"nozzle","[]","A","B ","C","D","A","B ","C","D","A","B ","C","D","A","B ","C","D","A","B ","C","D","A","B ","C","D","A","B ","C","D","A","B ","C","D","A","B ","C","D","A","B ","C","D","A","B ","C","D"]
["Qt [m³/h/m]",{"$f":"($F$1+($F$1*$O$5))/((B4-115)/1000)","v":1346.7129834723723},{"$f":"($F$1+($F$1*$O$5))/((C4-115)/1000)","v":832.04560125363128},738.02914913457687,{"$f":"($F$1+($F$1*$O$5))/((E4-115)/1000)","v":663.10233196355387},601.98690966276547,471.59263320151666,387.6295531062911,329.04574155370301,285.84498773921246,252.67148819500989,230.39005184624358,"[m³/h/m]","A",{"$f":"capacity!B13","v":6.5596735762048679},null,"L3 @ 2m",{"$f":"B2+(B3-2)","v":4.7},"m",null,"B",3,null,"v1","[m/s]",{"$f":"HLOOKUP(Z3,$B$11:$L$15,VLOOKUP(Z4,$U$4:$V$7,2,1),1)","v":{"$error":"#N/A"}},{"$f":"HLOOKUP(AA3,$B$11:$L$15,VLOOKUP(AA4,$U$4:$V$7,2,1),1)","v":{"$error":"#N/A"}},{"$error":"#N/A"},{"$error":"#N/A"},{"$error":"#N/A"},{"$error":"#N/A"},{"$error":"#N/A"},{"$error":"#N/A"},{"$f":"HLOOKUP(AH3,$B$11:$L$15,VLOOKUP(AH4,$U$4:$V$7,2,1),1)","v":{"$error":"#N/A"}},{"$error":"#N/A"},{"$error":"#N/A"},{"$f":"HLOOKUP(AK3,$B$11:$L$15,VLOOKUP(AK4,$U$4:$V$7,2,1),1)","v":8.0253261461447581E-2},{"$error":"#N/A"},{"$error":"#N/A"},{"$error":"#N/A"},7.1805724250006892E-2,{"$error":"#N/A"},{"$error":"#N/A"},7.6566951070340838E-2,6.6467869323422982E-2,{"$error":"#N/A"},7.3029012089111042E-2,6.3095984235408062E-2,5.8555479826519846E-2,7.0677727074830499E-2,6.3181308673599307E-2,5.7909563665086497E-2,5.5167733771901081E-2,6.2961239414008288E-2,5.8555704877079714E-2,5.5142061320352688E-2,5.3470622046129818E-2,5.8929708052149102E-2,5.6055036916478632E-2,5.3671135701012895E-2,5.233795684790201E-2,5.6636680781493878E-2,5.442922204928187E-2,5.25690233770508E-2,5.1649376443987746E-2,5.5140400365828221E-2,5.3504115271248306E-2,5.2025431283322689E-2,5.1186881963404526E-2]
["Qt [m³/h/m]",{"$f":"($F$1+($F$1*$O$6))/((B$4-115)/1000)","v":1149.9955953396432},{"$f":"($F$1+($F$1*$O$6))/((C$4-115)/1000)","v":710.50683278946099},630.22357484714905,566.24148603017954,514.05333063569299,402.70603880124685,331.0076342669002,280.98129155653749,244.09096881388484,215.76319680453651,{"$f":"($F$1+($F$1*$O$6))/((L$4-115)/1000)","v":196.73645987291954},"[m³/h/m]","B",{"$f":"capacity!C13","v":5.4554150895801721},null,null,null,null,null,"C",4,null,"v2","[m/s]",{"$f":"HLOOKUP(Z3,$Q$11:$AA$15,VLOOKUP(Z4,$U$4:$V$7,2,1),1)","v":{"$error":"#N/A"}},{"$f":"HLOOKUP(AA3,$Q$11:$AA$15,VLOOKUP(AA4,$U$4:$V$7,2,1),1)","v":{"$error":"#N/A"}},{"$error":"#N/A"},{"$f":"HLOOKUP(AC3,$Q$11:$AA$15,VLOOKUP(AC4,$U$4:$V$7,2,1),1)","v":{"$error":"#N/A"}},{"$error":"#N/A"},{"$error":"#N/A"},{"$error":"#N/A"},{"$error":"#N/A"},{"$error":"#N/A"},{"$error":"#N/A"},{"$error":"#N/A"},0.11717621402580217,{"$error":"#N/A"},{"$error":"#N/A"},{"$error":"#N/A"},0.10219176952202288,{"$error":"#N/A"},{"$error":"#N/A"},0.11090121008704293,9.1168126736451777E-2,{"$error":"#N/A"},0.10458533487430888,8.3272578681722886E-2,7.0939014600598649E-2,9.9905070620901357E-2,8.3479208628144758E-2,6.8834651177351935E-2,5.9895954329684128E-2,8.2946267535506449E-2,7.0939747804371608E-2,5.9794224160822876E-2,5.3170945535190681E-2,7.2069807227272825E-2,6.279269327287279E-2,5.3965504945763305E-2,4.8425394363263125E-2,6.4687660681921305E-2,5.6969513038853004E-2,4.953893471094481E-2,4.5107033780247829E-2,5.9787642429275867E-2,5.3303666457483183E-2,4.6919292085607051E-2,4.2878211342802217E-2]
{"$rows_left_out":141}
{"sheet":"noise","index":9,"n_rows":69,"n_cols":46,"rows_kept":69,"cut":false,"hidden":true,"merged":[[62,0,65,0],[13,0,16,0],[20,16,20,17],[20,26,20,27],[21,0,21,1],[21,8,21,9]]}
["COOLING"]
[]
["length beam","[mm]",600,600,600,600,900,900,900,900,1000,1000,1000,1000,1100,1100,1100,1100,1200,1200,1200,1200,1500,1500,1500,1500,1800,1800,1800,1800,2100,2100,2100,2100,2400,2400,2400,2400,2700,2700,2700,2700,2950,2950,2950,2950]
["nozzle","[]","A","B ","C","D","A","B ","C","D","A","B ","C","D","A","B ","C","D","A","B ","C","D","A","B ","C","D","A","B ","C","D","A","B ","C","D","A","B ","C","D","A","B ","C","D","A","B ","C","D"]
["no nozzles","[]",{"$f":"capacity!J14","v":28},{"$f":"capacity!K14","v":28},{"$f":"capacity!L14","v":28},{"$f":"capacity!M14","v":28},{"$f":"capacity!N14","v":46},{"$f":"capacity!O14","v":46},{"$f":"capacity!P14","v":46},{"$f":"capacity!Q14","v":46},{"$f":"capacity!R14","v":52},{"$f":"capacity!S14","v":52},{"$f":"capacity!T14","v":52},{"$f":"capacity!U14","v":52},{"$f":"capacity!V14","v":58},{"$f":"capacity!W14","v":58},{"$f":"capacity!X14","v":58},{"$f":"capacity!Y14","v":58},{"$f":"capacity!Z14","v":64},{"$f":"capacity!AA14","v":64},{"$f":"capacity!AB14","v":64},{"$f":"capacity!AC14","v":64},{"$f":"capacity!AD14","v":82},{"$f":"capacity!AE14","v":82},{"$f":"capacity!AF14","v":82},{"$f":"capacity!AG14","v":82},{"$f":"capacity!AH14","v":100},{"$f":"capacity!AI14","v":100},{"$f":"capacity!AJ14","v":100},{"$f":"capacity!AK14","v":100},{"$f":"capacity!AL14","v":118},{"$f":"capacity!AM14","v":118},{"$f":"capacity!AN14","v":118},{"$f":"capacity!AO14","v":118},{"$f":"capacity!AP14","v":136},{"$f":"capacity!AQ14","v":136},{"$f":"capacity!AR14","v":136},{"$f":"capacity!AS14","v":136},{"$f":"capacity!AT14","v":154},{"$f":"capacity!AU14","v":154},{"$f":"capacity!AV14","v":154},{"$f":"capacity!AW14","v":154},{"$f":"capacity!AX14","v":168},{"$f":"capacity!AY14","v":168},{"$f":"capacity!AZ14","v":168},{"$f":"capacity!BA14","v":168}]
["nozzle v","[m/s]",{"$f":"($C$20/3600)/C8","v":84.255766857034843},{"$f":"($C$20/3600)/D8","v":62.089360452582518},40.610033082024692,28.44138979275214,51.286118956456001,37.793523753745873,24.719150571667207,17.31215030863174,45.368489846095699,33.432732551390586,21.86694089032099,15.314594503789614,40.675197793051311,29.974174011591554,19.604843556839505,13.730326106845862,36.861897999952745,27.164095198004848,17.766889473385802,12.443108034329061,28.770261853621655,21.201245032589146,13.866840564593797,9.7116940755739023,23.591614719969762,17.385020926723104,11.370809262966914,7.9635891419705995,19.992893830482849,14.73306858196873,9.6362790364126401,6.7488043576022028,17.346775529389529,12.783103622590518,8.3608891639462612,5.8555802514489699,15.319230337642702,11.288974627742276,7.3836423785499443,5.1711617805003893,14.042627809505809,10.348226742097086,6.7683388470041157,4.740231632125357]
{"$rows_left_out":64}
{"sheet":"capacity","index":10,"n_rows":109,"n_cols":53,"rows_kept":109,"cut":false,"hidden":true,"merged":[[0,0,0,2],[4,9,4,12],[33,0,33,1],[52,6,71,6],[23,1,23,3],[10,1,10,4],[22,0,22,3],[22,6,47,6],[15,0,15,3],[9,0,9,4],[9,6,18,6],[78,6,103,6],[1,12,1,13],[4,45,4,48],[4,49,4,52],[4,25,4,28],[4,29,4,32],[4,33,4,36],[4,37,4,40],[4,41,4,44],[4,13,4,16],[4,17,4,20],[4,21,4,24]]}
["INPUT DATA",null,null,null,null,null,{"$f":"IF(O2=\"Two pipe\",\"C\",\"H\")","v":"H"},null,null,null,"Four pipe",null,null,null,null,null,null,"Yes"]
[null,"cooling","heating",null,null,null,{"$f":"G1","v":"H"},"dit word \"E\" als de mat er is",null,null,"Two pipe",null,"geselecteerd systeem",null,{"$f":"selection!B17","v":"Four pipe"},null,null,"No"]
["Room air temperature",{"$f":"selection!B12","v":25},{"$f":"selection!C12","v":20},"ºC",null,null,null,null,null,null,"type of system",null,null,null,null,null,null,"electrical film"]
["Supply (primary) air flow rate",{"$f":"selection!B13","v":86.4},{"$f":"selection!C13","v":86.4},"m3/h",null,null,"type battery"]
["Supply (primary) air temperature",{"$f":"selection!B14","v":20},{"$f":"selection!C14","v":20},"ºC",null,null,null,null,null,600,null,null,null,900,null,null,null,1000,null,null,null,1100,null,null,null,1200,1560,1630,1700,1500,1840,1910,1980,1800,2120,2190,2260,2100,null,null,null,2400,2470,2540,2610,2700,2750,2820,2890,2950,3030,3100,3170]
["Inlet water temperature",{"$f":"selection!B15","v":14},{"$f":"selection!C15","v":45},"ºC"]
{"$rows_left_out":104}
{"sheet":"info","index":11,"n_rows":22,"n_cols":3,"rows_kept":22,"cut":false,"hidden":false,"merged":[]}
[{"$f":"'general info'!A15","v":"Used abbreviation"},{"$f":"'general info'!B15","v":"Unit"},{"$f":"'general info'!C15","v":"Meaning"}]
[{"$f":"'general info'!A16","v":"Tr"},{"$f":"'general info'!B16","v":"ºC"},{"$f":"'general info'!C16","v":"Room Air Temperature (Tr):"}]
[{"$f":"'general info'!A17","v":"Qp"},{"$f":"'general info'!B17","v":"m3/h"},{"$f":"'general info'!C17","v":"Supply (Primary) Air Flow Rate:"}]
[{"$f":"'general info'!A18","v":"Tp"},{"$f":"'general info'!B18","v":"ºC"},{"$f":"'general info'!C18","v":"Supply (Primary) Air Temperature (Tp):"}]
[{"$f":"'general info'!A19","v":"Twin"},{"$f":"'general info'!B19","v":"ºC"},{"$f":"'general info'!C19","v":"Water Inlet Temperature  (Twin):"}]
[{"$f":"'general info'!A20","v":"Qw"},{"$f":"'general info'!B20","v":"l/h"},{"$f":"'general info'!C20","v":"Water Flow Rate :"}]
{"$rows_left_out":16}