{"text_format":"1","workbook":"xlsx","n_sheets":12,"sheets":["general info","selection","physical parameters","configuration","summary","air velocities","instelwaarden & data","talen","velocity","noise","capacity","info"],"not_rendered":{"charts":5,"images":11,"macros":1,"external_links":1,"defined_names":25,"comments":6,"pivot_tables":0},"unopened":[],"bounds":{"document_bytes":16777216,"sheet_cells":100000,"rows_first":2000,"rows_last":500,"rows_between":2000,"halvings":0,"cell_chars":16384,"cell_head_chars":4096},"cells_cut":0,"cells_raw":0,"read":"whole","date_system":"1900"}

{"sheet":"general info","index":0,"n_rows":36,"n_cols":10,"rows_kept":36,"cut":false,"hidden":true,"merged":[[0,5,1,5],[1,1,1,4]]}
["General info",null,null,null,null,{"$f":"selection!F1","v":"EN"}]
[{"$f":"IF($F$1=\"NL\",talen!A2,IF($F$1=\"FR\",talen!B2,IF($F$1=\"EN\",talen!C2,talen!D2)))","v":"Project/Building:"},{"$f":"selection!B2","v":0}]
[{"$f":"IF($F$1=\"NL\",talen!A3,IF($F$1=\"FR\",talen!B3,IF($F$1=\"EN\",talen!C3,talen!D3)))","v":"Reference/ Room data:"}]
[{"$f":"IF($F$1=\"NL\",talen!A4,IF($F$1=\"FR\",talen!B4,IF($F$1=\"EN\",talen!C4,talen!D4)))","v":"# per room:"},{"$f":"selection!B4","v":0}]
[]
["Configuration"]
[{"$f":"IF($F$1=\"NL\",talen!A6,IF($F$1=\"FR\",talen!B6,IF($F$1=\"EN\",talen!C6,talen!D6)))","v":"Choose model specifications:"},{"$f":"IF($F$1=\"NL\",talen!A60,IF($F$1=\"FR\",talen!B60,IF($F$1=\"EN\",talen!C60,talen!D60)))","v":"Name"},{"$f":"IF($F$1=\"NL\",talen!A50,IF($F$1=\"FR\",talen!B50,IF($F$1=\"EN\",talen!C50,talen!D50)))","v":"Mounting type"},{"$f":"IF($F$1=\"NL\",talen!$A61,IF($F$1=\"FR\",talen!$B61,IF($F$1=\"EN\",talen!$C61,talen!$D61)))","v":"Model"},{"$f":"IF($F$1=\"NL\",talen!$A52,IF($F$1=\"FR\",talen!$B52,IF($F$1=\"EN\",talen!$C52,talen!$D52)))","v":"Connection"},"Nozzle",{"$f":"IF($F$1=\"NL\",talen!$A62,IF($F$1=\"FR\",talen!$B62,IF($F$1=\"EN\",talen!$C62,talen!$D62)))","v":"Battery type"},{"$f":"IF($F$1=\"NL\",talen!$A59,IF($F$1=\"FR\",talen!$B59,IF($F$1=\"EN\",talen!$C59,talen!$D59)))","v":"Options"},{"$f":"IF($F$1=\"NL\",talen!$A63,IF($F$1=\"FR\",talen!$B63,IF($F$1=\"EN\",talen!$C63,talen!$D63)))","v":"Beam length"},{"$f":"IF($F$1=\"NL\",talen!$A64,IF($F$1=\"FR\",talen!$B64,IF($F$1=\"EN\",talen!$C64,talen!$D64)))","v":"Battery length"}]
[null,"K",{"$f":"selection!C8","v":"T: T-bar"},6,{"$f":"selection!E8","v":"L: left connection"},{"$f":"selection!F22","v":"D"},{"$f":"IF(capacity!$G$1=\"H\",'instelwaarden & data'!I3,IF(selection!B20=\"yes\",'instelwaarden & data'!I4,'instelwaarden & data'!I2))","v":"H: cooling & heating coil"},{"$f":"selection!H8","v":"- : None"},{"$f":"configuration!B1","v":1800},{"$f":"selection!F21","v":1800}]
[]
[]
[]
[]
[]
[]
[{"$f":"IF($F$1=\"NL\",talen!A58,IF($F$1=\"FR\",talen!B58,IF($F$1=\"EN\",talen!C58,talen!D58)))","v":"Used abbreviation"},{"$f":"IF($F$1=\"NL\",talen!A56,IF($F$1=\"FR\",talen!B56,IF($F$1=\"EN\",talen!C56,talen!D56)))","v":"Unit"},{"$f":"IF($F$1=\"NL\",talen!A57,IF($F$1=\"FR\",talen!B57,IF($F$1=\"EN\",talen!C57,talen!D57)))","v":"Meaning"}]
["Tr","ºC",{"$f":"IF($F$1=\"NL\",'instelwaarden & data'!T2,IF($F$1=\"FR\",'instelwaarden & data'!U2,IF($F$1=\"EN\",'instelwaarden & data'!V2,'instelwaarden & data'!W2)))","v":"Room Air Temperature (Tr):"}]
["Qp","m3/h",{"$f":"IF($F$1=\"NL\",'instelwaarden & data'!T3,IF($F$1=\"FR\",'instelwaarden & data'!U3,IF($F$1=\"EN\",'instelwaarden & data'!V3,'instelwaarden & data'!W3)))","v":"Supply (Primary) Air Flow Rate:"}]
["Tp","ºC",{"$f":"IF($F$1=\"NL\",'instelwaarden & data'!T4,IF($F$1=\"FR\",'instelwaarden & data'!U4,IF($F$1=\"EN\",'instelwaarden & data'!V4,'instelwaarden & data'!W4)))","v":"Supply (Primary) Air Temperature (Tp):"}]
["Twin","ºC",{"$f":"IF($F$1=\"NL\",'instelwaarden & data'!T5,IF($F$1=\"FR\",'instelwaarden & data'!U5,IF($F$1=\"EN\",'instelwaarden & data'!V5,'instelwaarden & data'!W5)))","v":"Water Inlet Temperature  (Twin):"}]
["Qw","l/h",{"$f":"IF($F$1=\"NL\",'instelwaarden & data'!T6,IF($F$1=\"FR\",'instelwaarden & data'!U6,IF($F$1=\"EN\",'instelwaarden & data'!V6,'instelwaarden & data'!W6)))","v":"Water Flow Rate :"}]
["type batt","C/H/E",{"$f":"IF($F$1=\"NL\",'instelwaarden & data'!T7,IF($F$1=\"FR\",'instelwaarden & data'!U7,IF($F$1=\"EN\",'instelwaarden & data'!V7,'instelwaarden & data'!W7)))","v":"Type of battery (cooling/cooling & heating):"}]
["x","m",{"$f":"IF($F$1=\"NL\",'instelwaarden & data'!T8,IF($F$1=\"FR\",'instelwaarden & data'!U8,IF($F$1=\"EN\",'instelwaarden & data'!V8,'instelwaarden & data'!W8)))","v":"Distance to wall:"}]
["y","m",{"$f":"IF($F$1=\"NL\",'instelwaarden & data'!T9,IF($F$1=\"FR\",'instelwaarden & data'!U9,IF($F$1=\"EN\",'instelwaarden & data'!V9,'instelwaarden & data'!W9)))","v":"Distance between chilled beams :"}]
["Pt","W",{"$f":"IF($F$1=\"NL\",'instelwaarden & data'!T10,IF($F$1=\"FR\",'instelwaarden & data'!U10,IF($F$1=\"EN\",'instelwaarden & data'!V10,'instelwaarden & data'!W10)))","v":"Total Capacity:"}]
["Ps","Pa",{"$f":"IF($F$1=\"NL\",'instelwaarden & data'!T11,IF($F$1=\"FR\",'instelwaarden & data'!U11,IF($F$1=\"EN\",'instelwaarden & data'!V11,'instelwaarden & data'!W11)))","v":"Plenum static pressure:"}]
["LwA","dB(A)",{"$f":"IF($F$1=\"NL\",'instelwaarden & data'!T12,IF($F$1=\"FR\",'instelwaarden & data'!U12,IF($F$1=\"EN\",'instelwaarden & data'!V12,'instelwaarden & data'!W12)))","v":"Sound Power Pw:"}]
["Pb","kPa",{"$f":"IF($F$1=\"NL\",'instelwaarden & data'!T13,IF($F$1=\"FR\",'instelwaarden & data'!U13,IF($F$1=\"EN\",'instelwaarden & data'!V13,'instelwaarden & data'!W13)))","v":"Water pressure drop:"}]
["Pw","W",{"$f":"IF($F$1=\"NL\",'instelwaarden & data'!T14,IF($F$1=\"FR\",'instelwaarden & data'!U14,IF($F$1=\"EN\",'instelwaarden & data'!V14,'instelwaarden & data'!W14)))","v":"Water capacity:"}]
["Pa","W",{"$f":"IF($F$1=\"NL\",'instelwaarden & data'!T15,IF($F$1=\"FR\",'instelwaarden & data'!U15,IF($F$1=\"EN\",'instelwaarden & data'!V15,'instelwaarden & data'!W15)))","v":"Air capacity:"}]
["V1","m/s",{"$f":"IF($F$1=\"NL\",'instelwaarden & data'!T16,IF($F$1=\"FR\",'instelwaarden & data'!U16,IF($F$1=\"EN\",'instelwaarden & data'!V16,'instelwaarden & data'!W16)))","v":"v1 (0,5m from wall @ 1,8m height):"}]
["V2","m/s",{"$f":"IF($F$1=\"NL\",'instelwaarden & data'!T17,IF($F$1=\"FR\",'instelwaarden & data'!U17,IF($F$1=\"EN\",'instelwaarden & data'!V17,'instelwaarden & data'!W17)))","v":"v2 (0,5m from wall @ 0,1 m height):"}]
["V3","m/s",{"$f":"IF($F$1=\"NL\",'instelwaarden & data'!T18,IF($F$1=\"FR\",'instelwaarden & data'!U18,IF($F$1=\"EN\",'instelwaarden & data'!V18,'instelwaarden & data'!W18)))","v":"v3 (between 2 chilled beams @ 1,8m height):"}]
["ΔT c","°C",{"$f":"IF($F$1=\"NL\",'instelwaarden & data'!T19,IF($F$1=\"FR\",'instelwaarden & data'!U19,IF($F$1=\"EN\",'instelwaarden & data'!V19,'instelwaarden & data'!W19)))","v":"ΔT battery cooling:"}]
["Δθ c","°C",{"$f":"IF($F$1=\"NL\",'instelwaarden & data'!T20,IF($F$1=\"FR\",'instelwaarden & data'!U20,IF($F$1=\"EN\",'instelwaarden & data'!V20,'instelwaarden & data'!W20)))","v":"Temp. diff. air-water mean Dq: cooling:"}]
["ΔT h","°C",{"$f":"IF($F$1=\"NL\",'instelwaarden & data'!T21,IF($F$1=\"FR\",'instelwaarden & data'!U21,IF($F$1=\"EN\",'instelwaarden & data'!V21,'instelwaarden & data'!W21)))","v":"ΔT battery heating:"}]
["Δθ h","°C",{"$f":"IF($F$1=\"NL\",'instelwaarden & data'!T22,IF($F$1=\"FR\",'instelwaarden & data'!U22,IF($F$1=\"EN\",'instelwaarden & data'!V22,'instelwaarden & data'!W22)))","v":"Temp. diff. air-water mean Dq: heating:"}]

{"sheet":"selection","index":1,"n_rows":51,"n_cols":61,"rows_kept":51,"cut":false,"hidden":false,"merged":[[42,5,43,5],[44,5,45,5],[10,4,10,6],[22,5,27,5],[29,5,34,5],[0,5,1,5],[1,1,1,4],[9,2,9,4],[16,1,16,2],[19,1,19,2]]}
["General info",null,null,null,null,"EN"]
[{"$f":"IF($F$1=\"NL\",talen!A2,IF($F$1=\"FR\",talen!B2,IF($F$1=\"EN\",talen!C2,talen!D2)))","v":"Project/Building:"}]
[{"$f":"IF($F$1=\"NL\",talen!A3,IF($F$1=\"FR\",talen!B3,IF($F$1=\"EN\",talen!C3,talen!D3)))","v":"Reference/ Room data:"}]
[{"$f":"IF($F$1=\"NL\",talen!A4,IF($F$1=\"FR\",talen!B4,IF($F$1=\"EN\",talen!C4,talen!D4)))","v":"# per room:"}]
[]
["Configuration"]
[{"$f":"IF($F$1=\"NL\",talen!A6,IF($F$1=\"FR\",talen!B6,IF($F$1=\"EN\",talen!C6,talen!D6)))","v":"Choose model specifications:"},{"$f":"IF($F$1=\"NL\",talen!A60,IF($F$1=\"FR\",talen!B60,IF($F$1=\"EN\",talen!C60,talen!D60)))","v":"Name"},{"$f":"IF($F$1=\"NL\",talen!A50,IF($F$1=\"FR\",talen!B50,IF($F$1=\"EN\",talen!C50,talen!D50)))","v":"Mounting type"},{"$f":"IF($F$1=\"NL\",talen!$A61,IF($F$1=\"FR\",talen!$B61,IF($F$1=\"EN\",talen!$C61,talen!$D61)))","v":"Model"},{"$f":"IF($F$1=\"NL\",talen!$A52,IF($F$1=\"FR\",talen!$B52,IF($F$1=\"EN\",talen!$C52,talen!$D52)))","v":"Connection"},"Nozzle",{"$f":"IF($F$1=\"NL\",talen!$A62,IF($F$1=\"FR\",talen!$B62,IF($F$1=\"EN\",talen!$C62,talen!$D62)))","v":"Battery type"},{"$f":"IF($F$1=\"NL\",talen!$A59,IF($F$1=\"FR\",talen!$B59,IF($F$1=\"EN\",talen!$C59,talen!$D59)))","v":"Options"},{"$f":"IF($F$1=\"NL\",talen!$A63,IF($F$1=\"FR\",talen!$B63,IF($F$1=\"EN\",talen!$C63,talen!$D63)))","v":"Beam length"},{"$f":"IF($F$1=\"NL\",talen!$A64,IF($F$1=\"FR\",talen!$B64,IF($F$1=\"EN\",talen!$C64,talen!$D64)))","v":"Battery length"}]
[null,"K","T: T-bar",6,"L: left connection",{"$f":"selection!F22","v":"D"},{"$f":"IF(capacity!$G$1=\"H\",'instelwaarden & data'!I3,IF(selection!B20=\"yes\",'instelwaarden & data'!I4,'instelwaarden & data'!I2))","v":"H: cooling & heating coil"},"- : None",{"$f":"configuration!B1","v":1800},{"$f":"selection!F21","v":1800}]
[]
["K-6  nozzle                    ",null,{"$f":"A3","v":"Reference/ Room data:"},null,null,{"$f":"IF(B3=\"\",\"\",B3)","v":""},{"$f":"MAX(H20:BI20)","v":0}]
[{"$f":"IF('general info'!$F$1=\"NL\",talen!$A65,IF('general info'!$F$1=\"FR\",talen!$B65,IF('general info'!$F$1=\"EN\",talen!$C65,talen!$D65)))","v":"Input data"},{"$f":"IF('general info'!$F$1=\"NL\",talen!$A53,IF('general info'!$F$1=\"FR\",talen!$B53,IF('general info'!$F$1=\"EN\",talen!$C53,talen!$D53)))","v":"Cooling"},{"$f":"IF('general info'!$F$1=\"NL\",talen!$A54,IF('general info'!$F$1=\"FR\",talen!$B54,IF('general info'!$F$1=\"EN\",talen!$C54,talen!$D54)))","v":"Heating"},null,{"$f":"IF('general info'!$F$1=\"NL\",talen!$A66,IF('general info'!$F$1=\"FR\",talen!$B66,IF('general info'!$F$1=\"EN\",talen!$C66,talen!$D66)))","v":"Required"}]
["Tr [°C]",25,20,null,"MIN",null,"ΔT  h",{"$f":"IF(ISBLANK($F$12),0,IF(AND(H49=0,ROUND(H45,2)>=$F$12),1,0))","v":0},{"$f":"IF(ISBLANK($F$12),0,IF(AND(I49=0,ROUND(I45,2)>=$F$12),1,0))","v":0},0,0,0,0,0,0,0,0,0,0,0,0,0,0,0,0,0,0,0,0,0,0,0,0,0,0,0,0,0,0,0,0,0,0,0,0,0,0,0,0,0,0,0,0,0,0,0,0,0,0,0,0]
["Qp [m³/h]",86.4,{"$f":"B13","v":86.4},null,"MIN",null,"Pt heating",{"$f":"IF(ISBLANK($F$13),0,IF(AND(H49=0,$F$13<=ROUND(H30,0)),1,0))","v":0},{"$f":"IF(ISBLANK($F$13),0,IF(AND(I49=0,$F$13<=ROUND(I30,0)),1,0))","v":0},0,0,0,0,0,0,0,0,0,0,0,0,0,0,0,0,0,0,0,0,0,0,0,0,0,0,0,0,0,0,0,0,0,0,0,0,0,0,0,0,0,0,0,0,0,0,0,0,0,0,0,0]
["Tp [°C]",20,20,null,"MAX",null,"length",{"$f":"IF(ISBLANK($F$14),0,IF(AND(H22<=$F$14,H49=0),1,0))","v":0},{"$f":"IF(ISBLANK($F$14),0,IF(AND(I22<=$F$14,I49=0),1,0))","v":0},0,0,0,0,0,0,0,0,0,0,0,0,0,0,0,0,0,0,0,0,0,0,0,0,0,0,0,0,0,0,0,0,0,0,0,0,0,0,0,0,0,0,0,0,0,0,0,0,0,0,0,0]
["Twin [°C]",14,45,null,"MAX",null,"v3 ",{"$f":"IF(ISNUMBER(H40),IF(ISBLANK($F$15),0,IF(AND(H49=0,ROUND(H40,2)<=$F$15),1,0)),0)","v":0},{"$f":"IF(ISNUMBER(I40),IF(ISBLANK($F$15),0,IF(AND(I49=0,ROUND(I40,2)<=$F$15),1,0)),0)","v":0},0,0,0,0,0,0,0,0,0,0,0,0,0,0,0,0,0,0,0,0,0,0,0,0,0,0,0,0,0,0,0,0,0,0,0,0,0,0,0,0,0,0,0,0,0,0,0,0,0,0,0,0]
["Qw [l/h]",100,100,null,"MAX",null,"Lwa dB(A)",{"$f":"IF(ISBLANK($F$16),0,IF(AND(H49=0,ROUND(H25,1)<$F$16+0.99),1,0))","v":0},{"$f":"IF(ISBLANK($F$16),0,IF(AND(I49=0,ROUND(I25,1)<$F$16+0.99),1,0))","v":0},0,0,0,0,0,0,0,0,0,0,0,0,0,0,0,0,0,0,0,0,0,0,0,0,0,0,0,0,0,0,0,0,0,0,0,0,0,0,0,0,0,0,0,0,0,0,0,0,0,0,0,0]
["Type of system","Four pipe",null,null,"MIN",null,"ΔT c",{"$f":"IF(ISBLANK($F$17),0,IF(AND(H49=0,ROUND(H43,2)>=$F$17),1,0))","v":0},{"$f":"IF(ISBLANK($F$17),0,IF(AND(I49=0,ROUND(I43,2)>=$F$17),1,0))","v":0},0,0,0,0,0,0,0,0,0,0,0,0,0,0,0,0,0,0,0,0,0,0,0,0,0,0,0,0,0,0,0,0,0,0,0,0,0,0,0,0,0,0,0,0,0,0,0,0,0,0,0,0]
["X [m]",4,{"$f":"B18","v":4},null,"MAX",null,"Ps",{"$f":"IF(AND(H49=0,ROUND(H24,0)<=$F$18),1,0)","v":0},{"$f":"IF(AND(I49=0,ROUND(I24,0)<=$F$18),1,0)","v":0},0,0,0,0,0,0,0,0,0,0,0,0,0,0,0,0,0,0,0,0,0,0,0,0,0,0,0,0,0,0,0,0,0,0,0,0,0,0,0,0,0,0,0,0,0,0,0,0,0,0,0,0]
["Y [m]",4,{"$f":"B19","v":4},null,"MIN",null,"Pt cooling",{"$f":"IF(ISBLANK($F$19),0,IF(AND(H49=0,ROUND(H23,0)>=$F$19),1,0))","v":0},{"$f":"IF(ISBLANK($F$19),0,IF(AND(I49=0,ROUND(I23,0)>=$F$19),1,0))","v":0},0,0,0,0,0,0,0,0,0,0,0,0,0,0,0,0,0,0,0,0,0,0,0,0,0,0,0,0,0,0,0,0,0,0,0,0,0,0,0,0,0,0,0,0,0,0,0,0,0,0,0,0]
["Electrical heating","No",null,null,{"$f":"IF('general info'!F1=\"NL\",talen!A76,IF('general info'!F1=\"FR\",talen!B76,IF('general info'!F1=\"EN\",talen!C76,talen!D76)))","v":"choose"},{"$f":"IF('general info'!F1=\"NL\",talen!A9,IF('general info'!F1=\"FR\",talen!B9,IF('general info'!F1=\"EN\",talen!C9,talen!D9)))","v":"battery length:"},{"$f":"IF('general info'!F1=\"NL\",talen!A77,IF('general info'!F1=\"FR\",talen!B77,IF('general info'!F1=\"EN\",talen!C77,talen!D77)))","v":"beam length:"},{"$f":"SUM(H12:H15,H17:H19)","v":0},{"$f":"SUM(I12:I15,I17:I19)","v":0},0,0,0,0,0,0,0,0,0,0,0,0,0,0,0,0,0,0,0,0,0,0,0,0,0,0,0,0,0,0,0,0,0,0,0,0,0,0,0,0,0,0,0,0,0,0,0,0,0,0,0,0]
["cooling only","No",{"$f":"IF(AND(B21=\"yes\",B22=\"yes\"),\"error\",0)","v":0},null,{"$f":"IF('general info'!F1=\"NL\",talen!A70,IF('general info'!F1=\"FR\",talen!B70,IF('general info'!F1=\"EN\",talen!C70,talen!D70)))","v":"Length [mm]:"},1800,1800,"A","B","C","D",null,"A","B","C","D",null,"A","B","C","D",null,"A","B","C","D",null,"A","B","C","D",null,"A","B","C","D",null,"A","B","C","D",null,"A","B","C","D",null,"A","B","C","D",null,"A","B","C","D",null,"A","B","C","D"]
["heating only","No",{"$f":"IF(AND(B22=\"yes\",B21=\"yes\"),\"error\",0)","v":0},null,{"$f":"IF('general info'!F1=\"NL\",talen!A18,IF('general info'!F1=\"FR\",talen!B18,IF('general info'!F1=\"EN\",talen!C18,talen!D18)))","v":"Nozzle type:"},"D",{"$f":"IF(G21<F21,\"! Error length !\",0)","v":0},600,600,600,600,null,900,900,900,900,null,1000,1000,1000,1000,null,1100,1100,1100,1100,null,1200,1200,1200,1200,null,1500,1500,1500,1500,null,1800,1800,1800,1800,null,2100,2100,2100,2100,null,2400,2400,2400,2400,null,2700,2700,2700,2700,null,2950,2950,2950,2950]
[{"$f":"IF('general info'!$F$1=\"NL\",talen!$A67,IF('general info'!$F$1=\"FR\",talen!$B67,IF('general info'!$F$1=\"EN\",talen!$C67,talen!$D67)))","v":"Calculated data"},null,null,null,null,{"$f":"IF('general info'!F1=\"NL\",talen!A53,IF('general info'!F1=\"FR\",talen!B53,IF('general info'!F1=\"EN\",talen!C53,talen!D53)))","v":"Cooling"},"Pt [W]",{"$f":"capacity!J48","v":1007.9587830921733},{"$f":"capacity!K48","v":749.2976392499653},{"$f":"capacity!L48","v":477.22229422710939},{"$f":"capacity!M48","v":488.56476969999744},null,{"$f":"capacity!N48","v":1090.3905954182942},{"$f":"capacity!O48","v":829.59764344352391},{"$f":"capacity!P48","v":555.279934435982},{"$f":"capacity!Q48","v":545.73418724452563},null,{"$f":"capacity!R48","v":1109.2696211346629},{"$f":"capacity!S48","v":848.02971970606905},{"$f":"capacity!T48","v":573.24188238682768},{"$f":"capacity!U48","v":558.56442727612148},null,{"$f":"capacity!V48","v":1125.7981406570709},{"$f":"capacity!W48","v":864.04934294645238},{"$f":"capacity!X48","v":588.72621791659481},{"$f":"capacity!Y48","v":569.58119687787803},null,{"$f":"capacity!Z48","v":1219.1878568846016},{"$f":"capacity!AA48","v":956.6633797098275},{"$f":"capacity!AB48","v":680.52434837606052},{"$f":"capacity!AC48","v":627.61203878984543},null,{"$f":"capacity!AD48","v":1257.1091821027405},{"$f":"capacity!AE48","v":982.41799433179824},{"$f":"capacity!AF48","v":693.48128517880286},{"$f":"capacity!AG48","v":640.41739853650961},null,{"$f":"capacity!AH48","v":1292.5261149546295},{"$f":"capacity!AI48","v":1005.0764927850565},{"$f":"capacity!AJ48","v":702.71969513559725},{"$f":"capacity!AK48","v":650.94062997056403},null,{"$f":"capacity!AL48","v":1326.549980055252},{"$f":"capacity!AM48","v":1026.0548516606707},{"$f":"capacity!AN48","v":709.97600610543043},{"$f":"capacity!AO48","v":660.21962372100438},null,{"$f":"capacity!AP48","v":1359.0859493605039},{"$f":"capacity!AQ48","v":1045.6556989965684},{"$f":"capacity!AR48","v":715.97091433332048},{"$f":"capacity!AS48","v":668.57334364762016},null,{"$f":"capacity!AT48","v":1389.6598958593308},{"$f":"capacity!AU48","v":1063.8060026707569},{"$f":"capacity!AV48","v":721.05328342040934},{"$f":"capacity!AW48","v":676.07674714511211},null,{"$f":"capacity!AX48","v":1413.2065673416755},{"$f":"capacity!AY48","v":1077.6659128045894},{"$f":"capacity!AZ48","v":724.72407547913417},{"$f":"capacity!BA48","v":681.66529717081517}]
[null,null,null,null,null,null,"Ps [Pa]",{"$f":"capacity!J16","v":5025.6200031262979},{"$f":"capacity!K16","v":3010.5069876195603},{"$f":"capacity!L16","v":1280.5092250201239},{"$f":"capacity!M16","v":628.04367315437946},null,{"$f":"capacity!N16","v":1862.0444624059628},{"$f":"capacity!O16","v":1115.4241390802154},{"$f":"capacity!P16","v":474.44198129290032},{"$f":"capacity!Q16","v":232.69671065833336},null,{"$f":"capacity!R16","v":1457.1324269419447},{"$f":"capacity!S16","v":872.86888990152943},{"$f":"capacity!T16","v":371.27190547920753},{"$f":"capacity!U16","v":182.09550286724607},null,{"$f":"capacity!V16","v":1171.2503217749756},{"$f":"capacity!W16","v":701.61637285782865},{"$f":"capacity!X16","v":298.43021177639031},{"$f":"capacity!Y16","v":146.36927459959375},null,{"$f":"capacity!Z16","v":961.93507872339296},{"$f":"capacity!AA16","v":576.22985309905653},{"$f":"capacity!AB16","v":245.0974688515081},{"$f":"capacity!AC16","v":120.21148431470543},null,{"$f":"capacity!AD16","v":585.97353992430385},{"$f":"capacity!AE16","v":351.01687660525516},{"$f":"capacity!AF16","v":149.30387156689133},{"$f":"capacity!AG16","v":73.228173669398174},null,{"$f":"capacity!AH16","v":394.00860824510187},{"$f":"capacity!AI16","v":236.02374782937358},{"$f":"capacity!AJ16","v":100.39192324157771},{"$f":"capacity!AK16","v":49.238623975303348},null,{"$f":"capacity!AL16","v":282.97084763365547},{"$f":"capacity!AM16","v":169.50858074502551},{"$f":"capacity!AN16","v":72.099916145919067},{"$f":"capacity!AO16","v":35.362413081947246},null,{"$f":"capacity!AP16","v":213.02368525362343},{"$f":"capacity!AQ16","v":127.60799514996408},{"$f":"capacity!AR16","v":54.2776401608876},{"$f":"capacity!AS16","v":26.621228360349996},null,{"$f":"capacity!AT16","v":166.13619845045619},{"$f":"capacity!AU16","v":99.520892152712733},{"$f":"capacity!AV16","v":42.330883471739625},{"$f":"capacity!AW16","v":20.761774319153037},null,{"$f":"capacity!AX16","v":139.60055564239718},{"$f":"capacity!AY16","v":83.625194100543354},{"$f":"capacity!AZ16","v":35.569700695003441},{"$f":"capacity!BA16","v":17.445657587621646}]
[null,null,null,null,null,null,"Lwa [dB(A)]",{"$f":"noise!C9","v":{"$error":"#NUM!"}},{"$f":"noise!D9","v":{"$error":"#NUM!"}},{"$f":"noise!E9","v":1999.0021091541998},{"$f":"noise!F9","v":61.798061437979172},null,{"$f":"noise!G9","v":{"$error":"#NUM!"}},{"$f":"noise!H9","v":499.86973427709086},{"$f":"noise!I9","v":70.977428410823549},{"$f":"noise!J9","v":36.901596411281311},null,{"$f":"noise!K9","v":1681.3482506691937},{"$f":"noise!L9","v":213.9613940782809},{"$f":"noise!M9","v":45.654262664423854},{"$f":"noise!N9","v":33.732227513012674},null,{"$f":"noise!O9","v":669.50242065247016},{"$f":"noise!P9","v":114.15250383627409},{"$f":"noise!Q9","v":34.708380820360567},{"$f":"noise!R9","v":31.520225737862862},null,{"$f":"noise!S9","v":322.45684069027703},{"$f":"noise!T9","v":72.162958453891846},{"$f":"noise!U9","v":29.323976733922393},{"$f":"noise!V9","v":29.927802907350006},null,{"$f":"noise!W9","v":79.625025430837979},{"$f":"noise!X9","v":34.977664648272466},{"$f":"noise!Y9","v":23.795638739518814},{"$f":"noise!Z9","v":27.200890049768471},null,{"$f":"noise!AA9","v":41.504253733091033},{"$f":"noise!AB9","v":27.216472814905615},{"$f":"noise!AC9","v":22.646868870520755},{"$f":"noise!AD9","v":25.973219914659854},null,{"$f":"noise!AE9","v":31.200051787437097},{"$f":"noise!AF9","v":24.897787214793837},{"$f":"noise!AG9","v":22.506072957965728},{"$f":"noise!AH9","v":25.398360624112314},null,{"$f":"noise!AI9","v":27.514388658446745},{"$f":"noise!AJ9","v":24.131896644925153},{"$f":"noise!AK9","v":22.674400339365306},{"$f":"noise!AL9","v":25.146543480278268},null,{"$f":"noise!AM9","v":25.996865591145109},{"$f":"noise!AN9","v":23.930833910818492},{"$f":"noise!AO9","v":22.948447948789092},{"$f":"noise!AP9","v":25.068484590946344},null,{"$f":"noise!AQ9","v":25.447233445155707},{"$f":"noise!AR9","v":23.946574711190198},{"$f":"noise!AS9","v":23.186772437080826},{"$f":"noise!AT9","v":25.078484567587061}]
[null,null,null,null,null,null,"Pb [kpa]",{"$f":"capacity!J47","v":1.7866520162073416},{"$f":"capacity!K47","v":1.7866520162073416},{"$f":"capacity!L47","v":1.7866520162073416},{"$f":"capacity!M47","v":1.7866520162073416},null,{"$f":"capacity!N47","v":2.492523494566615},{"$f":"capacity!O47","v":2.492523494566615},{"$f":"capacity!P47","v":2.492523494566615},{"$f":"capacity!Q47","v":2.492523494566615},null,{"$f":"capacity!R47","v":2.9233454518054995},{"$f":"capacity!S47","v":2.9233454518054995},{"$f":"capacity!T47","v":2.9233454518054995},{"$f":"capacity!U47","v":2.9233454518054995},null,{"$f":"capacity!V47","v":3.1814787827157143},{"$f":"capacity!W47","v":3.1814787827157143},{"$f":"capacity!X47","v":3.1814787827157143},{"$f":"capacity!Y47","v":3.1814787827157143},null,{"$f":"capacity!Z47","v":0.38028712973602552},{"$f":"capacity!AA47","v":0.38028712973602552},{"$f":"capacity!AB47","v":0.38028712973602552},{"$f":"capacity!AC47","v":0.38028712973602552},null,{"$f":"capacity!AD47","v":0.47716206457995974},{"$f":"capacity!AE47","v":0.47716206457995974},{"$f":"capacity!AF47","v":0.47716206457995974},{"$f":"capacity!AG47","v":0.47716206457995974},null,{"$f":"capacity!AH47","v":0.57920032115274711},{"$f":"capacity!AI47","v":0.57920032115274711},{"$f":"capacity!AJ47","v":0.57920032115274711},{"$f":"capacity!AK47","v":0.57920032115274711},null,{"$f":"capacity!AL47","v":0.69204662104362702},{"$f":"capacity!AM47","v":0.69204662104362702},{"$f":"capacity!AN47","v":0.69204662104362702},{"$f":"capacity!AO47","v":0.69204662104362702},null,{"$f":"capacity!AP47","v":0.78585329212730681},{"$f":"capacity!AQ47","v":0.78585329212730681},{"$f":"capacity!AR47","v":0.78585329212730681},{"$f":"capacity!AS47","v":0.78585329212730681},null,{"$f":"capacity!AT47","v":0.95706532310849757},{"$f":"capacity!AU47","v":0.95706532310849757},{"$f":"capacity!AV47","v":0.95706532310849757},{"$f":"capacity!AW47","v":0.95706532310849757},null,{"$f":"capacity!AX47","v":1.0597725363471082},{"$f":"capacity!AY47","v":1.0597725363471082},{"$f":"capacity!AZ47","v":1.0597725363471082},{"$f":"capacity!BA47","v":1.0597725363471082}]
[null,null,null,null,null,null,"Pw [W]",{"$f":"capacity!J43","v":865.95656075304271},{"$f":"capacity!K43","v":607.29541691083466},{"$f":"capacity!L43","v":335.22007188797875},{"$f":"capacity!M43","v":346.5625473608668},null,{"$f":"capacity!N43","v":948.38837307916367},{"$f":"capacity!O43","v":687.59542110439327},{"$f":"capacity!P43","v":413.27771209685136},{"$f":"capacity!Q43","v":403.73196490539505},null,{"$f":"capacity!R43","v":967.26739879553224},{"$f":"capacity!S43","v":706.02749736693841},{"$f":"capacity!T43","v":431.2396600476971},{"$f":"capacity!U43","v":416.56220493699078},null,{"$f":"capacity!V43","v":983.79591831794028},{"$f":"capacity!W43","v":722.04712060732174},{"$f":"capacity!X43","v":446.72399557746417},{"$f":"capacity!Y43","v":427.57897453874733},null,{"$f":"capacity!Z43","v":1077.185634545471},{"$f":"capacity!AA43","v":814.66115737069686},{"$f":"capacity!AB43","v":538.52212603692988},{"$f":"capacity!AC43","v":485.60981645071479},null,{"$f":"capacity!AD43","v":1115.1069597636099},{"$f":"capacity!AE43","v":840.4157719926676},{"$f":"capacity!AF43","v":551.47906283967222},{"$f":"capacity!AG43","v":498.41517619737903},null,{"$f":"capacity!AH43","v":1150.5238926154989},{"$f":"capacity!AI43","v":863.07427044592589},{"$f":"capacity!AJ43","v":560.71747279646661},{"$f":"capacity!AK43","v":508.93840763143334},null,{"$f":"capacity!AL43","v":1184.5477577161214},{"$f":"capacity!AM43","v":884.05262932154005},{"$f":"capacity!AN43","v":567.97378376629979},{"$f":"capacity!AO43","v":518.21740138187374},null,{"$f":"capacity!AP43","v":1217.0837270213733},{"$f":"capacity!AQ43","v":903.65347665743786},{"$f":"capacity!AR43","v":573.96869199418984},{"$f":"capacity!AS43","v":526.57112130848952},null,{"$f":"capacity!AT43","v":1247.6576735202002},{"$f":"capacity!AU43","v":921.80378033162629},{"$f":"capacity!AV43","v":579.0510610812787},{"$f":"capacity!AW43","v":534.07452480598147},null,{"$f":"capacity!AX43","v":1271.2043450025449},{"$f":"capacity!AY43","v":935.66369046545867},{"$f":"capacity!AZ43","v":582.72185314000353},{"$f":"capacity!BA43","v":539.66307483168453}]
[null,null,null,null,null,null,"Pa [W]",{"$f":"capacity!J18","v":142.00222233913064},{"$f":"capacity!K18","v":142.00222233913064},{"$f":"capacity!L18","v":142.00222233913064},{"$f":"capacity!M18","v":142.00222233913064},null,{"$f":"capacity!N18","v":142.00222233913064},{"$f":"capacity!O18","v":142.00222233913064},{"$f":"capacity!P18","v":142.00222233913064},{"$f":"capacity!Q18","v":142.00222233913064},null,{"$f":"capacity!R18","v":142.00222233913064},{"$f":"capacity!S18","v":142.00222233913064},{"$f":"capacity!T18","v":142.00222233913064},{"$f":"capacity!U18","v":142.00222233913064},null,{"$f":"capacity!V18","v":142.00222233913064},{"$f":"capacity!W18","v":142.00222233913064},{"$f":"capacity!X18","v":142.00222233913064},{"$f":"capacity!Y18","v":142.00222233913064},null,{"$f":"capacity!Z18","v":142.00222233913064},{"$f":"capacity!AA18","v":142.00222233913064},{"$f":"capacity!AB18","v":142.00222233913064},{"$f":"capacity!AC18","v":142.00222233913064},null,{"$f":"capacity!AD18","v":142.00222233913064},{"$f":"capacity!AE18","v":142.00222233913064},{"$f":"capacity!AF18","v":142.00222233913064},{"$f":"capacity!AG18","v":142.00222233913064},null,{"$f":"capacity!AH18","v":142.00222233913064},{"$f":"capacity!AI18","v":142.00222233913064},{"$f":"capacity!AJ18","v":142.00222233913064},{"$f":"capacity!AK18","v":142.00222233913064},null,{"$f":"capacity!AL18","v":142.00222233913064},{"$f":"capacity!AM18","v":142.00222233913064},{"$f":"capacity!AN18","v":142.00222233913064},{"$f":"capacity!AO18","v":142.00222233913064},null,{"$f":"capacity!AP18","v":142.00222233913064},{"$f":"capacity!AQ18","v":142.00222233913064},{"$f":"capacity!AR18","v":142.00222233913064},{"$f":"capacity!AS18","v":142.00222233913064},null,{"$f":"capacity!AT18","v":142.00222233913064},{"$f":"capacity!AU18","v":142.00222233913064},{"$f":"capacity!AV18","v":142.00222233913064},{"$f":"capacity!AW18","v":142.00222233913064},null,{"$f":"capacity!AX18","v":142.00222233913064},{"$f":"capacity!AY18","v":142.00222233913064},{"$f":"capacity!AZ18","v":142.00222233913064},{"$f":"capacity!BA18","v":142.00222233913064}]
[]
[null,null,null,null,null,{"$f":"IF('general info'!F1=\"NL\",talen!A54,IF('general info'!F1=\"FR\",talen!B54,IF('general info'!F1=\"EN\",talen!C54,talen!D54)))","v":"Heating"},"Pt [W]",{"$f":"IF($B$20=\"yes\",0,IF($B$17=\"Four pipe\",capacity!J$72,capacity!J$104))","v":515.49481545618528},{"$f":"IF($B$20=\"yes\",0,IF($B$17=\"Four pipe\",capacity!K$72,capacity!K$104))","v":507.77377579409125},{"$f":"IF($B$20=\"yes\",0,IF($B$17=\"Four pipe\",capacity!L$72,capacity!L$104))","v":471.57126047997605},{"$f":"IF($B$20=\"yes\",0,IF($B$17=\"Four pipe\",capacity!M$72,capacity!M$104))","v":429.28386026937676},null,{"$f":"IF($B$20=\"yes\",0,IF($B$17=\"Four pipe\",capacity!N$72,capacity!N$104))","v":562.22186549921389},{"$f":"IF($B$20=\"yes\",0,IF($B$17=\"Four pipe\",capacity!O$72,capacity!O$104))","v":547.95856262446614},{"$f":"IF($B$20=\"yes\",0,IF($B$17=\"Four pipe\",capacity!P$72,capacity!P$104))","v":509.79251000878116},{"$f":"IF($B$20=\"yes\",0,IF($B$17=\"Four pipe\",capacity!Q$72,capacity!Q$104))","v":468.11633257889167},null,{"$f":"IF($B$20=\"yes\",0,IF($B$17=\"Four pipe\",capacity!R$72,capacity!R$104))","v":577.95743565777536},{"$f":"IF($B$20=\"yes\",0,IF($B$17=\"Four pipe\",capacity!S$72,capacity!S$104))","v":563.03188699845282},{"$f":"IF($B$20=\"yes\",0,IF($B$17=\"Four pipe\",capacity!T$72,capacity!T$104))","v":525.33496318269317},{"$f":"IF($B$20=\"yes\",0,IF($B$17=\"Four pipe\",capacity!U$72,capacity!U$104))","v":484.23977361818959},null,{"$f":"IF($B$20=\"yes\",0,IF($B$17=\"Four pipe\",capacity!V$72,capacity!V$104))","v":594.04420265555711},{"$f":"IF($B$20=\"yes\",0,IF($B$17=\"Four pipe\",capacity!W$72,capacity!W$104))","v":579.07399740219034},{"$f":"IF($B$20=\"yes\",0,IF($B$17=\"Four pipe\",capacity!X$72,capacity!X$104))","v":542.25408382674459},{"$f":"IF($B$20=\"yes\",0,IF($B$17=\"Four pipe\",capacity!Y$72,capacity!Y$104))","v":501.801021452052},null,{"$f":"IF($B$20=\"yes\",0,IF($B$17=\"Four pipe\",capacity!Z$72,capacity!Z$104))","v":610.59109753472467},{"$f":"IF($B$20=\"yes\",0,IF($B$17=\"Four pipe\",capacity!AA$72,capacity!AA$104))","v":596.12269141361014},{"$f":"IF($B$20=\"yes\",0,IF($B$17=\"Four pipe\",capacity!AB$72,capacity!AB$104))","v":560.49660683544062},{"$f":"IF($B$20=\"yes\",0,IF($B$17=\"Four pipe\",capacity!AC$72,capacity!AC$104))","v":520.66026358345812},null,{"$f":"IF($B$20=\"yes\",0,IF($B$17=\"Four pipe\",capacity!AD$72,capacity!AD$104))","v":663.79148048141622},{"$f":"IF($B$20=\"yes\",0,IF($B$17=\"Four pipe\",capacity!AE$72,capacity!AE$104))","v":653.41875986681282},{"$f":"IF($B$20=\"yes\",0,IF($B$17=\"Four pipe\",capacity!AF$72,capacity!AF$104))","v":622.23412602443216},{"$f":"IF($B$20=\"yes\",0,IF($B$17=\"Four pipe\",capacity!AG$72,capacity!AG$104))","v":583.03635622277545},null,{"$f":"IF($B$20=\"yes\",0,IF($B$17=\"Four pipe\",capacity!AH$72,capacity!AH$104))","v":723.24581713003283},{"$f":"IF($B$20=\"yes\",0,IF($B$17=\"Four pipe\",capacity!AI$72,capacity!AI$104))","v":719.20354072096427},{"$f":"IF($B$20=\"yes\",0,IF($B$17=\"Four pipe\",capacity!AJ$72,capacity!AJ$104))","v":690.94805061231875},{"$f":"IF($B$20=\"yes\",0,IF($B$17=\"Four pipe\",capacity!AK$72,capacity!AK$104))","v":647.85143308246052},null,{"$f":"IF($B$20=\"yes\",0,IF($B$17=\"Four pipe\",capacity!AL$72,capacity!AL$104))","v":788.72691882350216},{"$f":"IF($B$20=\"yes\",0,IF($B$17=\"Four pipe\",capacity!AM$72,capacity!AM$104))","v":790.40199766826595},{"$f":"IF($B$20=\"yes\",0,IF($B$17=\"Four pipe\",capacity!AN$72,capacity!AN$104))","v":758.98778080334534},{"$f":"IF($B$20=\"yes\",0,IF($B$17=\"Four pipe\",capacity!AO$72,capacity!AO$104))","v":704.20115060932358},null,{"$f":"IF($B$20=\"yes\",0,IF($B$17=\"Four pipe\",capacity!AP$72,capacity!AP$104))","v":857.83218017551769},{"$f":"IF($B$20=\"yes\",0,IF($B$17=\"Four pipe\",capacity!AQ$72,capacity!AQ$104))","v":860.77583395082252},{"$f":"IF($B$20=\"yes\",0,IF($B$17=\"Four pipe\",capacity!AR$72,capacity!AR$104))","v":815.90084682501492},{"$f":"IF($B$20=\"yes\",0,IF($B$17=\"Four pipe\",capacity!AS$72,capacity!AS$104))","v":741.87429003505633},null,{"$f":"IF($B$20=\"yes\",0,IF($B$17=\"Four pipe\",capacity!AT$72,capacity!AT$104))","v":925.51311705657827},{"$f":"IF($B$20=\"yes\",0,IF($B$17=\"Four pipe\",capacity!AU$72,capacity!AU$104))","v":921.49239593328525},{"$f":"IF($B$20=\"yes\",0,IF($B$17=\"Four pipe\",capacity!AV$72,capacity!AV$104))","v":853.03434512815011},{"$f":"IF($B$20=\"yes\",0,IF($B$17=\"Four pipe\",capacity!AW$72,capacity!AW$104))","v":759.01598548740071},null,{"$f":"IF($B$20=\"yes\",0,IF($B$17=\"Four pipe\",capacity!AX$72,capacity!AX$104))","v":975.64524772232039},{"$f":"IF($B$20=\"yes\",0,IF($B$17=\"Four pipe\",capacity!AY$72,capacity!AY$104))","v":958.70115898405072},{"$f":"IF($B$20=\"yes\",0,IF($B$17=\"Four pipe\",capacity!AZ$72,capacity!AZ$104))","v":868.35148663549899},{"$f":"IF($B$20=\"yes\",0,IF($B$17=\"Four pipe\",capacity!BA$72,capacity!BA$104))","v":763.48050089406308}]
[null,null,null,null,null,null,"Ps [Pa]",{"$f":"capacity!J16","v":5025.6200031262979},{"$f":"capacity!K16","v":3010.5069876195603},{"$f":"capacity!L16","v":1280.5092250201239},{"$f":"capacity!M16","v":628.04367315437946},null,{"$f":"capacity!N16","v":1862.0444624059628},{"$f":"capacity!O16","v":1115.4241390802154},{"$f":"capacity!P16","v":474.44198129290032},{"$f":"capacity!Q16","v":232.69671065833336},null,{"$f":"capacity!R16","v":1457.1324269419447},{"$f":"capacity!S16","v":872.86888990152943},{"$f":"capacity!T16","v":371.27190547920753},{"$f":"capacity!U16","v":182.09550286724607},null,{"$f":"capacity!V16","v":1171.2503217749756},{"$f":"capacity!W16","v":701.61637285782865},{"$f":"capacity!X16","v":298.43021177639031},{"$f":"capacity!Y16","v":146.36927459959375},null,{"$f":"capacity!Z16","v":961.93507872339296},{"$f":"capacity!AA16","v":576.22985309905653},{"$f":"capacity!AB16","v":245.0974688515081},{"$f":"capacity!AC16","v":120.21148431470543},null,{"$f":"capacity!AD16","v":585.97353992430385},{"$f":"capacity!AE16","v":351.01687660525516},{"$f":"capacity!AF16","v":149.30387156689133},{"$f":"capacity!AG16","v":73.228173669398174},null,{"$f":"capacity!AH16","v":394.00860824510187},{"$f":"capacity!AI16","v":236.02374782937358},{"$f":"capacity!AJ16","v":100.39192324157771},{"$f":"capacity!AK16","v":49.238623975303348},null,{"$f":"capacity!AL16","v":282.97084763365547},{"$f":"capacity!AM16","v":169.50858074502551},{"$f":"capacity!AN16","v":72.099916145919067},{"$f":"capacity!AO16","v":35.362413081947246},null,{"$f":"capacity!AP16","v":213.02368525362343},{"$f":"capacity!AQ16","v":127.60799514996408},{"$f":"capacity!AR16","v":54.2776401608876},{"$f":"capacity!AS16","v":26.621228360349996},null,{"$f":"capacity!AT16","v":166.13619845045619},{"$f":"capacity!AU16","v":99.520892152712733},{"$f":"capacity!AV16","v":42.330883471739625},{"$f":"capacity!AW16","v":20.761774319153037},null,{"$f":"capacity!AX16","v":139.60055564239718},{"$f":"capacity!AY16","v":83.625194100543354},{"$f":"capacity!AZ16","v":35.569700695003441},{"$f":"capacity!BA16","v":17.445657587621646}]
[null,null,null,null,null,null,"Lwa [dB(A)]",{"$f":"noise!C58","v":{"$error":"#NUM!"}},{"$f":"noise!D58","v":{"$error":"#NUM!"}},{"$f":"noise!E58","v":1999.0021091541998},{"$f":"noise!F58","v":61.798061437979172},null,{"$f":"noise!G58","v":{"$error":"#NUM!"}},{"$f":"noise!H58","v":499.86973427709086},{"$f":"noise!I58","v":70.977428410823549},{"$f":"noise!J58","v":36.901596411281311},null,{"$f":"noise!K58","v":1681.3482506691937},{"$f":"noise!L58","v":213.9613940782809},{"$f":"noise!M58","v":45.654262664423854},{"$f":"noise!N58","v":33.732227513012674},null,{"$f":"noise!O58","v":669.50242065247016},{"$f":"noise!P58","v":114.15250383627409},{"$f":"noise!Q58","v":34.708380820360567},{"$f":"noise!R58","v":31.520225737862862},null,{"$f":"noise!S58","v":322.45684069027703},{"$f":"noise!T58","v":72.162958453891846},{"$f":"noise!U58","v":29.323976733922393},{"$f":"noise!V58","v":29.927802907350006},null,{"$f":"noise!W58","v":79.625025430837979},{"$f":"noise!X58","v":34.977664648272466},{"$f":"noise!Y58","v":23.795638739518814},{"$f":"noise!Z58","v":27.200890049768471},null,{"$f":"noise!AA58","v":41.504253733091033},{"$f":"noise!AB58","v":27.216472814905615},{"$f":"noise!AC58","v":22.646868870520755},{"$f":"noise!AD58","v":25.973219914659854},null,{"$f":"noise!AE58","v":31.200051787437097},{"$f":"noise!AF58","v":24.897787214793837},{"$f":"noise!AG58","v":22.506072957965728},{"$f":"noise!AH58","v":25.398360624112314},null,{"$f":"noise!AI58","v":27.514388658446745},{"$f":"noise!AJ58","v":24.131896644925153},{"$f":"noise!AK58","v":22.674400339365306},{"$f":"noise!AL58","v":25.146543480278268},null,{"$f":"noise!AM58","v":25.996865591145109},{"$f":"noise!AN58","v":23.930833910818492},{"$f":"noise!AO58","v":22.948447948789092},{"$f":"noise!AP58","v":25.068484590946344},null,{"$f":"noise!AQ58","v":25.447233445155707},{"$f":"noise!AR58","v":23.946574711190198},{"$f":"noise!AS58","v":23.186772437080826},{"$f":"noise!AT58","v":25.078484567587061}]
[null,null,null,null,null,null,"Pb [kpa]",{"$f":"IF($B$20=\"yes\",0,IF($B$17=\"four pipe\",capacity!J$71,capacity!J$103))","v":0.15070467763801482},{"$f":"IF($B$20=\"yes\",0,IF($B$17=\"four pipe\",capacity!K$71,capacity!K$103))","v":0.15070467763801482},{"$f":"IF($B$20=\"yes\",0,IF($B$17=\"four pipe\",capacity!L$71,capacity!L$103))","v":0.15070467763801482},{"$f":"IF($B$20=\"yes\",0,IF($B$17=\"four pipe\",capacity!M$71,capacity!M$103))","v":0.15070467763801482},null,{"$f":"IF($B$20=\"yes\",0,IF($B$17=\"four pipe\",capacity!N$71,capacity!N$103))","v":0.23230913173652687},{"$f":"IF($B$20=\"yes\",0,IF($B$17=\"four pipe\",capacity!O$71,capacity!O$103))","v":0.23230913173652687},{"$f":"IF($B$20=\"yes\",0,IF($B$17=\"four pipe\",capacity!P$71,capacity!P$103))","v":0.23230913173652687},{"$f":"IF($B$20=\"yes\",0,IF($B$17=\"four pipe\",capacity!Q$71,capacity!Q$103))","v":0.23230913173652687},null,{"$f":"IF($B$20=\"yes\",0,IF($B$17=\"four pipe\",capacity!R$71,capacity!R$103))","v":0.26712747252630187},{"$f":"IF($B$20=\"yes\",0,IF($B$17=\"four pipe\",capacity!S$71,capacity!S$103))","v":0.26712747252630187},{"$f":"IF($B$20=\"yes\",0,IF($B$17=\"four pipe\",capacity!T$71,capacity!T$103))","v":0.26712747252630187},{"$f":"IF($B$20=\"yes\",0,IF($B$17=\"four pipe\",capacity!U$71,capacity!U$103))","v":0.26712747252630187},null,{"$f":"IF($B$20=\"yes\",0,IF($B$17=\"four pipe\",capacity!V$71,capacity!V$103))","v":0.2937098900724297},{"$f":"IF($B$20=\"yes\",0,IF($B$17=\"four pipe\",capacity!W$71,capacity!W$103))","v":0.2937098900724297},{"$f":"IF($B$20=\"yes\",0,IF($B$17=\"four pipe\",capacity!X$71,capacity!X$103))","v":0.2937098900724297},{"$f":"IF($B$20=\"yes\",0,IF($B$17=\"four pipe\",capacity!Y$71,capacity!Y$103))","v":0.2937098900724297},null,{"$f":"IF($B$20=\"yes\",0,IF($B$17=\"four pipe\",capacity!Z$71,capacity!Z$103))","v":0.32031428530472456},{"$f":"IF($B$20=\"yes\",0,IF($B$17=\"four pipe\",capacity!AA$71,capacity!AA$103))","v":0.32031428530472456},{"$f":"IF($B$20=\"yes\",0,IF($B$17=\"four pipe\",capacity!AB$71,capacity!AB$103))","v":0.32031428530472456},{"$f":"IF($B$20=\"yes\",0,IF($B$17=\"four pipe\",capacity!AC$71,capacity!AC$103))","v":0.32031428530472456},null,{"$f":"IF($B$20=\"yes\",0,IF($B$17=\"four pipe\",capacity!AD$71,capacity!AD$103))","v":0.41673922753994136},{"$f":"IF($B$20=\"yes\",0,IF($B$17=\"four pipe\",capacity!AE$71,capacity!AE$103))","v":0.41673922753994136},{"$f":"IF($B$20=\"yes\",0,IF($B$17=\"four pipe\",capacity!AF$71,capacity!AF$103))","v":0.41673922753994136},{"$f":"IF($B$20=\"yes\",0,IF($B$17=\"four pipe\",capacity!AG$71,capacity!AG$103))","v":0.41673922753994136},null,{"$f":"IF($B$20=\"yes\",0,IF($B$17=\"four pipe\",capacity!AH$71,capacity!AH$103))","v":0.52530979699911717},{"$f":"IF($B$20=\"yes\",0,IF($B$17=\"four pipe\",capacity!AI$71,capacity!AI$103))","v":0.52530979699911717},{"$f":"IF($B$20=\"yes\",0,IF($B$17=\"four pipe\",capacity!AJ$71,capacity!AJ$103))","v":0.52530979699911717},{"$f":"IF($B$20=\"yes\",0,IF($B$17=\"four pipe\",capacity!AK$71,capacity!AK$103))","v":0.52530979699911717},null,{"$f":"IF($B$20=\"yes\",0,IF($B$17=\"four pipe\",capacity!AL$71,capacity!AL$103))","v":0.63811377241762945},{"$f":"IF($B$20=\"yes\",0,IF($B$17=\"four pipe\",capacity!AM$71,capacity!AM$103))","v":0.63811377241762945},{"$f":"IF($B$20=\"yes\",0,IF($B$17=\"four pipe\",capacity!AN$71,capacity!AN$103))","v":0.63811377241762945},{"$f":"IF($B$20=\"yes\",0,IF($B$17=\"four pipe\",capacity!AO$71,capacity!AO$103))","v":0.63811377241762945},null,{"$f":"IF($B$20=\"yes\",0,IF($B$17=\"four pipe\",capacity!AP$71,capacity!AP$103))","v":0.83835786224449582},{"$f":"IF($B$20=\"yes\",0,IF($B$17=\"four pipe\",capacity!AQ$71,capacity!AQ$103))","v":0.83835786224449582},{"$f":"IF($B$20=\"yes\",0,IF($B$17=\"four pipe\",capacity!AR$71,capacity!AR$103))","v":0.83835786224449582},{"$f":"IF($B$20=\"yes\",0,IF($B$17=\"four pipe\",capacity!AS$71,capacity!AS$103))","v":0.83835786224449582},null,{"$f":"IF($B$20=\"yes\",0,IF($B$17=\"four pipe\",capacity!AT$71,capacity!AT$103))","v":0.92220528661515744},{"$f":"IF($B$20=\"yes\",0,IF($B$17=\"four pipe\",capacity!AU$71,capacity!AU$103))","v":0.92220528661515744},{"$f":"IF($B$20=\"yes\",0,IF($B$17=\"four pipe\",capacity!AV$71,capacity!AV$103))","v":0.92220528661515744},{"$f":"IF($B$20=\"yes\",0,IF($B$17=\"four pipe\",capacity!AW$71,capacity!AW$103))","v":0.92220528661515744},null,{"$f":"IF($B$20=\"yes\",0,IF($B$17=\"four pipe\",capacity!AX$71,capacity!AX$103))","v":1.0476404265928443},{"$f":"IF($B$20=\"yes\",0,IF($B$17=\"four pipe\",capacity!AY$71,capacity!AY$103))","v":1.0476404265928443},{"$f":"IF($B$20=\"yes\",0,IF($B$17=\"four pipe\",capacity!AZ$71,capacity!AZ$103))","v":1.0476404265928443},{"$f":"IF($B$20=\"yes\",0,IF($B$17=\"four pipe\",capacity!BA$71,capacity!BA$103))","v":1.0476404265928443}]
[null,null,null,null,null,null,"Pw [W]",{"$f":"IF($B$20=\"yes\",0,IF($B$17=\"Four pipe\",capacity!J$59,capacity!J$99))","v":515.49481545618528},{"$f":"IF($B$20=\"yes\",0,IF($B$17=\"Four pipe\",capacity!K$59,capacity!K$99))","v":507.77377579409125},{"$f":"IF($B$20=\"yes\",0,IF($B$17=\"Four pipe\",capacity!L$59,capacity!L$99))","v":471.57126047997605},{"$f":"IF($B$20=\"yes\",0,IF($B$17=\"Four pipe\",capacity!M$59,capacity!M$99))","v":429.28386026937676},null,{"$f":"IF($B$20=\"yes\",0,IF($B$17=\"Four pipe\",capacity!N$59,capacity!N$99))","v":562.22186549921389},{"$f":"IF($B$20=\"yes\",0,IF($B$17=\"Four pipe\",capacity!O$59,capacity!O$99))","v":547.95856262446614},{"$f":"IF($B$20=\"yes\",0,IF($B$17=\"Four pipe\",capacity!P$59,capacity!P$99))","v":509.79251000878116},{"$f":"IF($B$20=\"yes\",0,IF($B$17=\"Four pipe\",capacity!Q$59,capacity!Q$99))","v":468.11633257889167},null,{"$f":"IF($B$20=\"yes\",0,IF($B$17=\"Four pipe\",capacity!R$59,capacity!R$99))","v":577.95743565777536},{"$f":"IF($B$20=\"yes\",0,IF($B$17=\"Four pipe\",capacity!S$59,capacity!S$99))","v":563.03188699845282},{"$f":"IF($B$20=\"yes\",0,IF($B$17=\"Four pipe\",capacity!T$59,capacity!T$99))","v":525.33496318269317},{"$f":"IF($B$20=\"yes\",0,IF($B$17=\"Four pipe\",capacity!U$59,capacity!U$99))","v":484.23977361818959},null,{"$f":"IF($B$20=\"yes\",0,IF($B$17=\"Four pipe\",capacity!V$59,capacity!V$99))","v":594.04420265555711},{"$f":"IF($B$20=\"yes\",0,IF($B$17=\"Four pipe\",capacity!W$59,capacity!W$99))","v":579.07399740219034},{"$f":"IF($B$20=\"yes\",0,IF($B$17=\"Four pipe\",capacity!X$59,capacity!X$99))","v":542.25408382674459},{"$f":"IF($B$20=\"yes\",0,IF($B$17=\"Four pipe\",capacity!Y$59,capacity!Y$99))","v":501.801021452052},null,{"$f":"IF($B$20=\"yes\",0,IF($B$17=\"Four pipe\",capacity!Z$59,capacity!Z$99))","v":610.59109753472467},{"$f":"IF($B$20=\"yes\",0,IF($B$17=\"Four pipe\",capacity!AA$59,capacity!AA$99))","v":596.12269141361014},{"$f":"IF($B$20=\"yes\",0,IF($B$17=\"Four pipe\",capacity!AB$59,capacity!AB$99))","v":560.49660683544062},{"$f":"IF($B$20=\"yes\",0,IF($B$17=\"Four pipe\",capacity!AC$59,capacity!AC$99))","v":520.66026358345812},null,{"$f":"IF($B$20=\"yes\",0,IF($B$17=\"Four pipe\",capacity!AD$59,capacity!AD$99))","v":663.79148048141622},{"$f":"IF($B$20=\"yes\",0,IF($B$17=\"Four pipe\",capacity!AE$59,capacity!AE$99))","v":653.41875986681282},{"$f":"IF($B$20=\"yes\",0,IF($B$17=\"Four pipe\",capacity!AF$59,capacity!AF$99))","v":622.23412602443216},{"$f":"IF($B$20=\"yes\",0,IF($B$17=\"Four pipe\",capacity!AG$59,capacity!AG$99))","v":583.03635622277545},null,{"$f":"IF($B$20=\"yes\",0,IF($B$17=\"Four pipe\",capacity!AH$59,capacity!AH$99))","v":723.24581713003283},{"$f":"IF($B$20=\"yes\",0,IF($B$17=\"Four pipe\",capacity!AI$59,capacity!AI$99))","v":719.20354072096427},{"$f":"IF($B$20=\"yes\",0,IF($B$17=\"Four pipe\",capacity!AJ$59,capacity!AJ$99))","v":690.94805061231875},{"$f":"IF($B$20=\"yes\",0,IF($B$17=\"Four pipe\",capacity!AK$59,capacity!AK$99))","v":647.85143308246052},null,{"$f":"IF($B$20=\"yes\",0,IF($B$17=\"Four pipe\",capacity!AL$59,capacity!AL$99))","v":788.72691882350216},{"$f":"IF($B$20=\"yes\",0,IF($B$17=\"Four pipe\",capacity!AM$59,capacity!AM$99))","v":790.40199766826595},{"$f":"IF($B$20=\"yes\",0,IF($B$17=\"Four pipe\",capacity!AN$59,capacity!AN$99))","v":758.98778080334534},{"$f":"IF($B$20=\"yes\",0,IF($B$17=\"Four pipe\",capacity!AO$59,capacity!AO$99))","v":704.20115060932358},null,{"$f":"IF($B$20=\"yes\",0,IF($B$17=\"Four pipe\",capacity!AP$59,capacity!AP$99))","v":857.83218017551769},{"$f":"IF($B$20=\"yes\",0,IF($B$17=\"Four pipe\",capacity!AQ$59,capacity!AQ$99))","v":860.77583395082252},{"$f":"IF($B$20=\"yes\",0,IF($B$17=\"Four pipe\",capacity!AR$59,capacity!AR$99))","v":815.90084682501492},{"$f":"IF($B$20=\"yes\",0,IF($B$17=\"Four pipe\",capacity!AS$59,capacity!AS$99))","v":741.87429003505633},null,{"$f":"IF($B$20=\"yes\",0,IF($B$17=\"Four pipe\",capacity!AT$59,capacity!AT$99))","v":925.51311705657827},{"$f":"IF($B$20=\"yes\",0,IF($B$17=\"Four pipe\",capacity!AU$59,capacity!AU$99))","v":921.49239593328525},{"$f":"IF($B$20=\"yes\",0,IF($B$17=\"Four pipe\",capacity!AV$59,capacity!AV$99))","v":853.03434512815011},{"$f":"IF($B$20=\"yes\",0,IF($B$17=\"Four pipe\",capacity!AW$59,capacity!AW$99))","v":759.01598548740071},null,{"$f":"IF($B$20=\"yes\",0,IF($B$17=\"Four pipe\",capacity!AX$59,capacity!AX$99))","v":975.64524772232039},{"$f":"IF($B$20=\"yes\",0,IF($B$17=\"Four pipe\",capacity!AY$59,capacity!AY$99))","v":958.70115898405072},{"$f":"IF($B$20=\"yes\",0,IF($B$17=\"Four pipe\",capacity!AZ$59,capacity!AZ$99))","v":868.35148663549899},{"$f":"IF($B$20=\"yes\",0,IF($B$17=\"Four pipe\",capacity!BA$59,capacity!BA$99))","v":763.48050089406308}]
[null,null,null,null,null,null,"Pa [W]",{"$f":"IF($B$17=\"Four pipe\",capacity!J$20,capacity!J$108)","v":0},{"$f":"IF($B$17=\"Four pipe\",capacity!K$20,capacity!K$108)","v":0},{"$f":"IF($B$17=\"Four pipe\",capacity!L$20,capacity!L$108)","v":0},{"$f":"IF($B$17=\"Four pipe\",capacity!M$20,capacity!M$108)","v":0},null,{"$f":"IF($B$17=\"Four pipe\",capacity!N$20,capacity!N$108)","v":0},{"$f":"IF($B$17=\"Four pipe\",capacity!O$20,capacity!O$108)","v":0},{"$f":"IF($B$17=\"Four pipe\",capacity!P$20,capacity!P$108)","v":0},{"$f":"IF($B$17=\"Four pipe\",capacity!Q$20,capacity!Q$108)","v":0},null,{"$f":"IF($B$17=\"Four pipe\",capacity!R$20,capacity!R$108)","v":0},{"$f":"IF($B$17=\"Four pipe\",capacity!S$20,capacity!S$108)","v":0},{"$f":"IF($B$17=\"Four pipe\",capacity!T$20,capacity!T$108)","v":0},{"$f":"IF($B$17=\"Four pipe\",capacity!U$20,capacity!U$108)","v":0},null,{"$f":"IF($B$17=\"Four pipe\",capacity!V$20,capacity!V$108)","v":0},{"$f":"IF($B$17=\"Four pipe\",capacity!W$20,capacity!W$108)","v":0},{"$f":"IF($B$17=\"Four pipe\",capacity!X$20,capacity!X$108)","v":0},{"$f":"IF($B$17=\"Four pipe\",capacity!Y$20,capacity!Y$108)","v":0},null,{"$f":"IF($B$17=\"Four pipe\",capacity!Z$20,capacity!Z$108)","v":0},{"$f":"IF($B$17=\"Four pipe\",capacity!AA$20,capacity!AA$108)","v":0},{"$f":"IF($B$17=\"Four pipe\",capacity!AB$20,capacity!AB$108)","v":0},{"$f":"IF($B$17=\"Four pipe\",capacity!AC$20,capacity!AC$108)","v":0},null,{"$f":"IF($B$17=\"Four pipe\",capacity!AD$20,capacity!AD$108)","v":0},{"$f":"IF($B$17=\"Four pipe\",capacity!AE$20,capacity!AE$108)","v":0},{"$f":"IF($B$17=\"Four pipe\",capacity!AF$20,capacity!AF$108)","v":0},{"$f":"IF($B$17=\"Four pipe\",capacity!AG$20,capacity!AG$108)","v":0},null,{"$f":"IF($B$17=\"Four pipe\",capacity!AH$20,capacity!AH$108)","v":0},{"$f":"IF($B$17=\"Four pipe\",capacity!AI$20,capacity!AI$108)","v":0},{"$f":"IF($B$17=\"Four pipe\",capacity!AJ$20,capacity!AJ$108)","v":0},{"$f":"IF($B$17=\"Four pipe\",capacity!AK$20,capacity!AK$108)","v":0},null,{"$f":"IF($B$17=\"Four pipe\",capacity!AL$20,capacity!AL$108)","v":0},{"$f":"IF($B$17=\"Four pipe\",capacity!AM$20,capacity!AM$108)","v":0},{"$f":"IF($B$17=\"Four pipe\",capacity!AN$20,capacity!AN$108)","v":0},{"$f":"IF($B$17=\"Four pipe\",capacity!AO$20,capacity!AO$108)","v":0},null,{"$f":"IF($B$17=\"Four pipe\",capacity!AP$20,capacity!AP$108)","v":0},{"$f":"IF($B$17=\"Four pipe\",capacity!AQ$20,capacity!AQ$108)","v":0},{"$f":"IF($B$17=\"Four pipe\",capacity!AR$20,capacity!AR$108)","v":0},{"$f":"IF($B$17=\"Four pipe\",capacity!AS$20,capacity!AS$108)","v":0},null,{"$f":"IF($B$17=\"Four pipe\",capacity!AT$20,capacity!AT$108)","v":0},{"$f":"IF($B$17=\"Four pipe\",capacity!AU$20,capacity!AU$108)","v":0},{"$f":"IF($B$17=\"Four pipe\",capacity!AV$20,capacity!AV$108)","v":0},{"$f":"IF($B$17=\"Four pipe\",capacity!AW$20,capacity!AW$108)","v":0},null,{"$f":"IF($B$17=\"Four pipe\",capacity!AX$20,capacity!AX$108)","v":0},{"$f":"IF($B$17=\"Four pipe\",capacity!AY$20,capacity!AY$108)","v":0},{"$f":"IF($B$17=\"Four pipe\",capacity!AZ$20,capacity!AZ$108)","v":0},{"$f":"IF($B$17=\"Four pipe\",capacity!BA$20,capacity!BA$108)","v":0}]
[]
[null,null,null,null,null,{"$f":"IF('general info'!F1=\"NL\",talen!A69,IF('general info'!F1=\"FR\",talen!B69,IF('general info'!F1=\"EN\",talen!C69,talen!D69)))","v":"Air velocity"}]
[null,null,null,null,null,{"$f":"IF('general info'!F1=\"NL\",talen!A53,IF('general info'!F1=\"FR\",talen!B53,IF('general info'!F1=\"EN\",talen!C53,talen!D53)))","v":"Cooling"},"V1 [m/s]",{"$f":"velocity!Z5","v":{"$error":"#N/A"}},{"$f":"velocity!AA5","v":{"$error":"#N/A"}},{"$f":"velocity!AB5","v":{"$error":"#N/A"}},{"$f":"velocity!AC5","v":{"$error":"#N/A"}},null,{"$f":"velocity!AD5","v":{"$error":"#N/A"}},{"$f":"velocity!AE5","v":{"$error":"#N/A"}},{"$f":"velocity!AF5","v":{"$error":"#N/A"}},{"$f":"velocity!AG5","v":{"$error":"#N/A"}},null,{"$f":"velocity!AH5","v":{"$error":"#N/A"}},{"$f":"velocity!AI5","v":{"$error":"#N/A"}},{"$f":"velocity!AJ5","v":{"$error":"#N/A"}},{"$f":"velocity!AK5","v":8.0253261461447581E-2},null,{"$f":"velocity!AL5","v":{"$error":"#N/A"}},{"$f":"velocity!AM5","v":{"$error":"#N/A"}},{"$f":"velocity!AN5","v":{"$error":"#N/A"}},{"$f":"velocity!AO5","v":7.1805724250006892E-2},null,{"$f":"velocity!AP5","v":{"$error":"#N/A"}},{"$f":"velocity!AQ5","v":{"$error":"#N/A"}},{"$f":"velocity!AR5","v":7.6566951070340838E-2},{"$f":"velocity!AS5","v":6.6467869323422982E-2},null,{"$f":"velocity!AT5","v":{"$error":"#N/A"}},{"$f":"velocity!AU5","v":7.3029012089111042E-2},{"$f":"velocity!AV5","v":6.3095984235408062E-2},{"$f":"velocity!AW5","v":5.8555479826519846E-2},null,{"$f":"velocity!AX5","v":7.0677727074830499E-2},{"$f":"velocity!AY5","v":6.3181308673599307E-2},{"$f":"velocity!AZ5","v":5.7909563665086497E-2},{"$f":"velocity!BA5","v":5.5167733771901081E-2},null,{"$f":"velocity!BB5","v":6.2961239414008288E-2},{"$f":"velocity!BC5","v":5.8555704877079714E-2},{"$f":"velocity!BD5","v":5.5142061320352688E-2},{"$f":"velocity!BE5","v":5.3470622046129818E-2},null,{"$f":"velocity!BF5","v":5.8929708052149102E-2},{"$f":"velocity!BG5","v":5.6055036916478632E-2},{"$f":"velocity!BH5","v":5.3671135701012895E-2},{"$f":"velocity!BI5","v":5.233795684790201E-2},null,{"$f":"velocity!BJ5","v":5.6636680781493878E-2},{"$f":"velocity!BK5","v":5.442922204928187E-2},{"$f":"velocity!BL5","v":5.25690233770508E-2},{"$f":"velocity!BM5","v":5.1649376443987746E-2},null,{"$f":"velocity!BN5","v":5.5140400365828221E-2},{"$f":"velocity!BO5","v":5.3504115271248306E-2},{"$f":"velocity!BP5","v":5.2025431283322689E-2},{"$f":"velocity!BQ5","v":5.1186881963404526E-2}]
[null,null,null,null,null,"&","V2 [m/s]",{"$f":"velocity!Z6","v":{"$error":"#N/A"}},{"$f":"velocity!AA6","v":{"$error":"#N/A"}},{"$f":"velocity!AB6","v":{"$error":"#N/A"}},{"$f":"velocity!AC6","v":{"$error":"#N/A"}},null,{"$f":"velocity!AD6","v":{"$error":"#N/A"}},{"$f":"velocity!AE6","v":{"$error":"#N/A"}},{"$f":"velocity!AF6","v":{"$error":"#N/A"}},{"$f":"velocity!AG6","v":{"$error":"#N/A"}},null,{"$f":"velocity!AH6","v":{"$error":"#N/A"}},{"$f":"velocity!AI6","v":{"$error":"#N/A"}},{"$f":"velocity!AJ6","v":{"$error":"#N/A"}},{"$f":"velocity!AK6","v":0.11717621402580217},null,{"$f":"velocity!AL6","v":{"$error":"#N/A"}},{"$f":"velocity!AM6","v":{"$error":"#N/A"}},{"$f":"velocity!AN6","v":{"$error":"#N/A"}},{"$f":"velocity!AO6","v":0.10219176952202288},null,{"$f":"velocity!AP6","v":{"$error":"#N/A"}},{"$f":"velocity!AQ6","v":{"$error":"#N/A"}},{"$f":"velocity!AR6","v":0.11090121008704293},{"$f":"velocity!AS6","v":9.1168126736451777E-2},null,{"$f":"velocity!AT6","v":{"$error":"#N/A"}},{"$f":"velocity!AU6","v":0.10458533487430888},{"$f":"velocity!AV6","v":8.3272578681722886E-2},{"$f":"velocity!AW6","v":7.0939014600598649E-2},null,{"$f":"velocity!AX6","v":9.9905070620901357E-2},{"$f":"velocity!AY6","v":8.3479208628144758E-2},{"$f":"velocity!AZ6","v":6.8834651177351935E-2},{"$f":"velocity!BA6","v":5.9895954329684128E-2},null,{"$f":"velocity!BB6","v":8.2946267535506449E-2},{"$f":"velocity!BC6","v":7.0939747804371608E-2},{"$f":"velocity!BD6","v":5.9794224160822876E-2},{"$f":"velocity!BE6","v":5.3170945535190681E-2},null,{"$f":"velocity!BF6","v":7.2069807227272825E-2},{"$f":"velocity!BG6","v":6.279269327287279E-2},{"$f":"velocity!BH6","v":5.3965504945763305E-2},{"$f":"velocity!BI6","v":4.8425394363263125E-2},null,{"$f":"velocity!BJ6","v":6.4687660681921305E-2},{"$f":"velocity!BK6","v":5.6969513038853004E-2},{"$f":"velocity!BL6","v":4.953893471094481E-2},{"$f":"velocity!BM6","v":4.5107033780247829E-2},null,{"$f":"velocity!BN6","v":5.9787642429275867E-2},{"$f":"velocity!BO6","v":5.3303666457483183E-2},{"$f":"velocity!BP6","v":4.6919292085607051E-2},{"$f":"velocity!BQ6","v":4.2878211342802217E-2}]
[null,null,null,null,null,{"$f":"IF('general info'!F1=\"NL\",talen!A54,IF('general info'!F1=\"FR\",talen!B54,IF('general info'!F1=\"EN\",talen!C54,talen!D54)))","v":"Heating"},"V3 [m/s]",{"$f":"velocity!Z7","v":{"$error":"#N/A"}},{"$f":"velocity!AA7","v":{"$error":"#N/A"}},{"$f":"velocity!AB7","v":{"$error":"#N/A"}},{"$f":"velocity!AC7","v":{"$error":"#N/A"}},null,{"$f":"velocity!AD7","v":{"$error":"#N/A"}},{"$f":"velocity!AE7","v":{"$error":"#N/A"}},{"$f":"velocity!AF7","v":{"$error":"#N/A"}},{"$f":"velocity!AG7","v":{"$error":"#N/A"}},null,{"$f":"velocity!AH7","v":{"$error":"#N/A"}},{"$f":"velocity!AI7","v":{"$error":"#N/A"}},{"$f":"velocity!AJ7","v":{"$error":"#N/A"}},{"$f":"velocity!AK7","v":0.66610966147529715},null,{"$f":"velocity!AL7","v":{"$error":"#N/A"}},{"$f":"velocity!AM7","v":{"$error":"#N/A"}},{"$f":"velocity!AN7","v":{"$error":"#N/A"}},{"$f":"velocity!AO7","v":0.57155253943932727},null,{"$f":"velocity!AP7","v":{"$error":"#N/A"}},{"$f":"velocity!AQ7","v":{"$error":"#N/A"}},{"$f":"velocity!AR7","v":0.62707750146618413},{"$f":"velocity!AS7","v":0.52301097688628229},null,{"$f":"velocity!AT7","v":{"$error":"#N/A"}},{"$f":"velocity!AU7","v":0.58297462111434606},{"$f":"velocity!AV7","v":0.47723188576611242},{"$f":"velocity!AW7","v":0.40399390582152861},null,{"$f":"velocity!AX7","v":0.5624721656797026},{"$f":"velocity!AY7","v":0.47834383557250565},{"$f":"velocity!AZ7","v":0.38703993611359233},{"$f":"velocity!BA7","v":0.31484410401935237},null,{"$f":"velocity!BB7","v":0.47547588852494516},{"$f":"velocity!BC7","v":0.40399981293548959},{"$f":"velocity!BD7","v":0.31347551734958667},{"$f":"velocity!BE7","v":0.22437185283541117},null,{"$f":"velocity!BF7","v":0.4105334182055359},{"$f":"velocity!BG7","v":0.33836242625119228},{"$f":"velocity!BH7","v":0.23506114422083679},{"$f":"velocity!BI7","v":0.17237009810512591},null,{"$f":"velocity!BJ7","v":0.35362938047384634},{"$f":"velocity!BK7","v":0.27547438129781154},{"$f":"velocity!BL7","v":0.17824051991874632},{"$f":"velocity!BM7","v":0.15487618655306787},null,{"$f":"velocity!BN7","v":0.31338697262229454},{"$f":"velocity!BO7","v":0.22615736137316111},{"$f":"velocity!BP7","v":0.16443014722440297},{"$f":"velocity!BQ7","v":0.14312616071636811}]
[]
[null,null,null,null,null,"Extra data"]
[null,null,null,null,null,{"$f":"IF('general info'!F1=\"NL\",talen!A53,IF('general info'!F1=\"FR\",talen!B53,IF('general info'!F1=\"EN\",talen!C53,talen!D53)))","v":"Cooling"},"ΔT c [°C]",{"$f":"capacity!J44","v":7.4505223460572507},{"$f":"capacity!K44","v":5.2250520169483332},{"$f":"capacity!L44","v":2.8841685017969048},{"$f":"capacity!M44","v":2.9817569615423571},null,{"$f":"capacity!N44","v":8.1597496763839388},{"$f":"capacity!O44","v":5.9159376834445059},{"$f":"capacity!P44","v":3.5557613033468627},{"$f":"capacity!Q44","v":3.4736315453623385},null,{"$f":"capacity!R44","v":8.3221811531421679},{"$f":"capacity!S44","v":6.074523693762278},{"$f":"capacity!T44","v":3.710302420825224},{"$f":"capacity!U44","v":3.5840204429042135},null,{"$f":"capacity!V44","v":8.4643893303535691},{"$f":"capacity!W44","v":6.2123534260344169},{"$f":"capacity!X44","v":3.8435266414236038},{"$f":"capacity!Y44","v":3.6788065924864437},null,{"$f":"capacity!Z44","v":9.267896341190335},{"$f":"capacity!AA44","v":7.009186641160178},{"$f":"capacity!AB44","v":4.6333399569088112},{"$f":"capacity!AC44","v":4.1780927045399689},null,{"$f":"capacity!AD44","v":9.5941640706987936},{"$f":"capacity!AE44","v":7.2307743517356613},{"$f":"capacity!AF44","v":4.7448189289040519},{"$f":"capacity!AG44","v":4.2882675369343994},null,{"$f":"capacity!AH44","v":9.8988844938714529},{"$f":"capacity!AI44","v":7.425723679109888},{"$f":"capacity!AJ44","v":4.8243044169119935},{"$f":"capacity!AK44","v":4.3788073798151714},null,{"$f":"capacity!AL44","v":10.191619232217892},{"$f":"capacity!AM44","v":7.6062174113248764},{"$f":"capacity!AN44","v":4.8867363095506597},{"$f":"capacity!AO44","v":4.4586420429147413},null,{"$f":"capacity!AP44","v":10.471552403633108},{"$f":"capacity!AQ44","v":7.7748593013415865},{"$f":"capacity!AR44","v":4.9383153375744397},{"$f":"capacity!AS44","v":4.530515829437971},null,{"$f":"capacity!AT44","v":10.734604711243756},{"$f":"capacity!AU44","v":7.931020994942787},{"$f":"capacity!AV44","v":4.98204305576545},{"$f":"capacity!AW44","v":4.5950736582751741},null,{"$f":"capacity!AX44","v":10.93719570714997},{"$f":"capacity!AY44","v":8.050268974398783},{"$f":"capacity!AZ44","v":5.0136258388989088},{"$f":"capacity!BA44","v":4.643156459117229}]
[null,null,null,null,null,null,"Δθ c [°C]",{"$f":"capacity!J45","v":7.274738826971376},{"$f":"capacity!K45","v":8.3874739915258338},{"$f":"capacity!L45","v":9.5579157491015483},{"$f":"capacity!M45","v":9.5091215192288221},null,{"$f":"capacity!N45","v":6.9201251618080306},{"$f":"capacity!O45","v":8.0420311582777479},{"$f":"capacity!P45","v":9.2221193483265687},{"$f":"capacity!Q45","v":9.2631842273188312},null,{"$f":"capacity!R45","v":6.8389094234289161},{"$f":"capacity!S45","v":7.9627381531188597},{"$f":"capacity!T45","v":9.1448487895873889},{"$f":"capacity!U45","v":9.2079897785478941},null,{"$f":"capacity!V45","v":6.7678053348232154},{"$f":"capacity!W45","v":7.8938232869827907},{"$f":"capacity!X45","v":9.0782366792881977},{"$f":"capacity!Y45","v":9.1605967037567773},null,{"$f":"capacity!Z45","v":6.3660518294048316},{"$f":"capacity!AA45","v":7.4954066794199115},{"$f":"capacity!AB45","v":8.6833300215455935},{"$f":"capacity!AC45","v":8.9109536477300146},null,{"$f":"capacity!AD45","v":6.2029179646506023},{"$f":"capacity!AE45","v":7.3846128241321694},{"$f":"capacity!AF45","v":8.6275905355479736},{"$f":"capacity!AG45","v":8.8558662315328007},null,{"$f":"capacity!AH45","v":6.0505577530642753},{"$f":"capacity!AI45","v":7.2871381604450569},{"$f":"capacity!AJ45","v":8.5878477915440037},{"$f":"capacity!AK45","v":8.8105963100924143},null,{"$f":"capacity!AL45","v":5.9041903838910557},{"$f":"capacity!AM45","v":7.1968912943375614},{"$f":"capacity!AN45","v":8.5566318452246719},{"$f":"capacity!AO45","v":8.7706789785426302},null,{"$f":"capacity!AP45","v":5.7642237981834441},{"$f":"capacity!AQ45","v":7.1125703493292072},{"$f":"capacity!AR45","v":8.5308423312127815},{"$f":"capacity!AS45","v":8.7347420852810131},null,{"$f":"capacity!AT45","v":5.6326976443781227},{"$f":"capacity!AU45","v":7.0344895025286078},{"$f":"capacity!AV45","v":8.5089784721172741},{"$f":"capacity!AW45","v":8.7024631708624121},null,{"$f":"capacity!AX45","v":5.531402146425016},{"$f":"capacity!AY45","v":6.9748655128006085},{"$f":"capacity!AZ45","v":8.4931870805505447},{"$f":"capacity!BA45","v":8.6784217704413855}]
[null,null,null,null,null,{"$f":"IF('general info'!F1=\"NL\",talen!A54,IF('general info'!F1=\"FR\",talen!B54,IF('general info'!F1=\"EN\",talen!C54,talen!D54)))","v":"Heating"},"ΔT h [°C]",{"$f":"IF($B$20=\"yes\",0,IF($B$17=\"Four pipe\",capacity!J$68,capacity!J$100))","v":4.483517063972414},{"$f":"IF($B$20=\"yes\",0,IF($B$17=\"Four pipe\",capacity!K$68,capacity!K$100))","v":4.4163633079332341},{"$f":"IF($B$20=\"yes\",0,IF($B$17=\"Four pipe\",capacity!L$68,capacity!L$100))","v":4.1014918673234613},{"$f":"IF($B$20=\"yes\",0,IF($B$17=\"Four pipe\",capacity!M$68,capacity!M$100))","v":3.7336971296257215},null,{"$f":"IF($B$20=\"yes\",0,IF($B$17=\"Four pipe\",capacity!N$68,capacity!N$100))","v":4.889925663895216},{"$f":"IF($B$20=\"yes\",0,IF($B$17=\"Four pipe\",capacity!O$68,capacity!O$100))","v":4.7658705620588453},{"$f":"IF($B$20=\"yes\",0,IF($B$17=\"Four pipe\",capacity!P$68,capacity!P$100))","v":4.4339212523156188},{"$f":"IF($B$20=\"yes\",0,IF($B$17=\"Four pipe\",capacity!Q$68,capacity!Q$100))","v":4.0714426258279905},null,{"$f":"IF($B$20=\"yes\",0,IF($B$17=\"Four pipe\",capacity!R$68,capacity!R$100))","v":5.0267858130216663},{"$f":"IF($B$20=\"yes\",0,IF($B$17=\"Four pipe\",capacity!S$68,capacity!S$100))","v":4.8969708273093397},{"$f":"IF($B$20=\"yes\",0,IF($B$17=\"Four pipe\",capacity!T$68,capacity!T$100))","v":4.5691017661284672},{"$f":"IF($B$20=\"yes\",0,IF($B$17=\"Four pipe\",capacity!U$68,capacity!U$100))","v":4.2116762826217506},null,{"$f":"IF($B$20=\"yes\",0,IF($B$17=\"Four pipe\",capacity!V$68,capacity!V$100))","v":5.1667004972748449},{"$f":"IF($B$20=\"yes\",0,IF($B$17=\"Four pipe\",capacity!W$68,capacity!W$100))","v":5.0364971107572858},{"$f":"IF($B$20=\"yes\",0,IF($B$17=\"Four pipe\",capacity!X$68,capacity!X$100))","v":4.7162558476838425},{"$f":"IF($B$20=\"yes\",0,IF($B$17=\"Four pipe\",capacity!Y$68,capacity!Y$100))","v":4.3644152665397424},null,{"$f":"IF($B$20=\"yes\",0,IF($B$17=\"Four pipe\",capacity!Z$68,capacity!Z$100))","v":5.3106171445855512},{"$f":"IF($B$20=\"yes\",0,IF($B$17=\"Four pipe\",capacity!AA$68,capacity!AA$100))","v":5.1847781569032136},{"$f":"IF($B$20=\"yes\",0,IF($B$17=\"Four pipe\",capacity!AB$68,capacity!AB$100))","v":4.8749202236330316},{"$f":"IF($B$20=\"yes\",0,IF($B$17=\"Four pipe\",capacity!AC$68,capacity!AC$100))","v":4.5284435581432563},null,{"$f":"IF($B$20=\"yes\",0,IF($B$17=\"Four pipe\",capacity!AD$68,capacity!AD$100))","v":5.7733275688218786},{"$f":"IF($B$20=\"yes\",0,IF($B$17=\"Four pipe\",capacity!AE$68,capacity!AE$100))","v":5.6831108130350385},{"$f":"IF($B$20=\"yes\",0,IF($B$17=\"Four pipe\",capacity!AF$68,capacity!AF$100))","v":5.4118824053500552},{"$f":"IF($B$20=\"yes\",0,IF($B$17=\"Four pipe\",capacity!AG$68,capacity!AG$100))","v":5.0709597335674763},null,{"$f":"IF($B$20=\"yes\",0,IF($B$17=\"Four pipe\",capacity!AH$68,capacity!AH$100))","v":6.2904317663788172},{"$f":"IF($B$20=\"yes\",0,IF($B$17=\"Four pipe\",capacity!AI$68,capacity!AI$100))","v":6.2552740602022503},{"$f":"IF($B$20=\"yes\",0,IF($B$17=\"Four pipe\",capacity!AJ$68,capacity!AJ$100))","v":6.0095218852925818},{"$f":"IF($B$20=\"yes\",0,IF($B$17=\"Four pipe\",capacity!AK$68,capacity!AK$100))","v":5.6346889785375085},null,{"$f":"IF($B$20=\"yes\",0,IF($B$17=\"Four pipe\",capacity!AL$68,capacity!AL$100))","v":6.8599537635119505},{"$f":"IF($B$20=\"yes\",0,IF($B$17=\"Four pipe\",capacity!AM$68,capacity!AM$100))","v":6.8745227647100551},{"$f":"IF($B$20=\"yes\",0,IF($B$17=\"Four pipe\",capacity!AN$68,capacity!AN$100))","v":6.6012975582827886},{"$f":"IF($B$20=\"yes\",0,IF($B$17=\"Four pipe\",capacity!AO$68,capacity!AO$100))","v":6.1247907458232547},null,{"$f":"IF($B$20=\"yes\",0,IF($B$17=\"Four pipe\",capacity!AP$68,capacity!AP$100))","v":7.4609968956486883},{"$f":"IF($B$20=\"yes\",0,IF($B$17=\"Four pipe\",capacity!AQ$68,capacity!AQ$100))","v":7.4865993295360713},{"$f":"IF($B$20=\"yes\",0,IF($B$17=\"Four pipe\",capacity!AR$68,capacity!AR$100))","v":7.0962990500928118},{"$f":"IF($B$20=\"yes\",0,IF($B$17=\"Four pipe\",capacity!AS$68,capacity!AS$100))","v":6.4524529422300407},null,{"$f":"IF($B$20=\"yes\",0,IF($B$17=\"Four pipe\",capacity!AT$68,capacity!AT$100))","v":8.0496519631944974},{"$f":"IF($B$20=\"yes\",0,IF($B$17=\"Four pipe\",capacity!AU$68,capacity!AU$100))","v":8.0146817341538696},{"$f":"IF($B$20=\"yes\",0,IF($B$17=\"Four pipe\",capacity!AV$68,capacity!AV$100))","v":7.4192677168868002},{"$f":"IF($B$20=\"yes\",0,IF($B$17=\"Four pipe\",capacity!AW$68,capacity!AW$100))","v":6.6015428685719613},null,{"$f":"IF($B$20=\"yes\",0,IF($B$17=\"Four pipe\",capacity!AX$68,capacity!AX$100))","v":8.4856762578214795},{"$f":"IF($B$20=\"yes\",0,IF($B$17=\"Four pipe\",capacity!AY$68,capacity!AY$100))","v":8.3383050162227317},{"$f":"IF($B$20=\"yes\",0,IF($B$17=\"Four pipe\",capacity!AZ$68,capacity!AZ$100))","v":7.5524885820834857},{"$f":"IF($B$20=\"yes\",0,IF($B$17=\"Four pipe\",capacity!BA$68,capacity!BA$100))","v":6.6403729991726435}]
[null,null,null,null,null,null,"Δθ h [°C]",{"$f":"IF($B$20=\"yes\",0,IF($B$17=\"Four pipe\",capacity!J$69,capacity!J$101))","v":22.758241468013793},{"$f":"IF($B$20=\"yes\",0,IF($B$17=\"Four pipe\",capacity!K$69,capacity!K$101))","v":22.791818346033381},{"$f":"IF($B$20=\"yes\",0,IF($B$17=\"Four pipe\",capacity!L$69,capacity!L$101))","v":22.94925406633827},{"$f":"IF($B$20=\"yes\",0,IF($B$17=\"Four pipe\",capacity!M$69,capacity!M$101))","v":23.133151435187138},null,{"$f":"IF($B$20=\"yes\",0,IF($B$17=\"Four pipe\",capacity!N$69,capacity!N$101))","v":22.555037168052394},{"$f":"IF($B$20=\"yes\",0,IF($B$17=\"Four pipe\",capacity!O$69,capacity!O$101))","v":22.617064718970575},{"$f":"IF($B$20=\"yes\",0,IF($B$17=\"Four pipe\",capacity!P$69,capacity!P$101))","v":22.783039373842193},{"$f":"IF($B$20=\"yes\",0,IF($B$17=\"Four pipe\",capacity!Q$69,capacity!Q$101))","v":22.964278687086008},null,{"$f":"IF($B$20=\"yes\",0,IF($B$17=\"Four pipe\",capacity!R$69,capacity!R$101))","v":22.48660709348917},{"$f":"IF($B$20=\"yes\",0,IF($B$17=\"Four pipe\",capacity!S$69,capacity!S$101))","v":22.551514586345327},{"$f":"IF($B$20=\"yes\",0,IF($B$17=\"Four pipe\",capacity!T$69,capacity!T$101))","v":22.715449116935766},{"$f":"IF($B$20=\"yes\",0,IF($B$17=\"Four pipe\",capacity!U$69,capacity!U$101))","v":22.894161858689124},null,{"$f":"IF($B$20=\"yes\",0,IF($B$17=\"Four pipe\",capacity!V$69,capacity!V$101))","v":22.416649751362577},{"$f":"IF($B$20=\"yes\",0,IF($B$17=\"Four pipe\",capacity!W$69,capacity!W$101))","v":22.481751444621359},{"$f":"IF($B$20=\"yes\",0,IF($B$17=\"Four pipe\",capacity!X$69,capacity!X$101))","v":22.64187207615808},{"$f":"IF($B$20=\"yes\",0,IF($B$17=\"Four pipe\",capacity!Y$69,capacity!Y$101))","v":22.817792366730131},null,{"$f":"IF($B$20=\"yes\",0,IF($B$17=\"Four pipe\",capacity!Z$69,capacity!Z$101))","v":22.344691427707225},{"$f":"IF($B$20=\"yes\",0,IF($B$17=\"Four pipe\",capacity!AA$69,capacity!AA$101))","v":22.407610921548397},{"$f":"IF($B$20=\"yes\",0,IF($B$17=\"Four pipe\",capacity!AB$69,capacity!AB$101))","v":22.562539888183487},{"$f":"IF($B$20=\"yes\",0,IF($B$17=\"Four pipe\",capacity!AC$69,capacity!AC$101))","v":22.735778220928374},null,{"$f":"IF($B$20=\"yes\",0,IF($B$17=\"Four pipe\",capacity!AD$69,capacity!AD$101))","v":22.113336215589058},{"$f":"IF($B$20=\"yes\",0,IF($B$17=\"Four pipe\",capacity!AE$69,capacity!AE$101))","v":22.158444593482479},{"$f":"IF($B$20=\"yes\",0,IF($B$17=\"Four pipe\",capacity!AF$69,capacity!AF$101))","v":22.294058797324972},{"$f":"IF($B$20=\"yes\",0,IF($B$17=\"Four pipe\",capacity!AG$69,capacity!AG$101))","v":22.464520133216261},null,{"$f":"IF($B$20=\"yes\",0,IF($B$17=\"Four pipe\",capacity!AH$69,capacity!AH$101))","v":21.854784116810592},{"$f":"IF($B$20=\"yes\",0,IF($B$17=\"Four pipe\",capacity!AI$69,capacity!AI$101))","v":21.872362969898873},{"$f":"IF($B$20=\"yes\",0,IF($B$17=\"Four pipe\",capacity!AJ$69,capacity!AJ$101))","v":21.995239057353707},{"$f":"IF($B$20=\"yes\",0,IF($B$17=\"Four pipe\",capacity!AK$69,capacity!AK$101))","v":22.182655510731244},null,{"$f":"IF($B$20=\"yes\",0,IF($B$17=\"Four pipe\",capacity!AL$69,capacity!AL$101))","v":21.570023118244023},{"$f":"IF($B$20=\"yes\",0,IF($B$17=\"Four pipe\",capacity!AM$69,capacity!AM$101))","v":21.562738617644975},{"$f":"IF($B$20=\"yes\",0,IF($B$17=\"Four pipe\",capacity!AN$69,capacity!AN$101))","v":21.699351220858603},{"$f":"IF($B$20=\"yes\",0,IF($B$17=\"Four pipe\",capacity!AO$69,capacity!AO$101))","v":21.937604627088376},null,{"$f":"IF($B$20=\"yes\",0,IF($B$17=\"Four pipe\",capacity!AP$69,capacity!AP$101))","v":21.269501552175655},{"$f":"IF($B$20=\"yes\",0,IF($B$17=\"Four pipe\",capacity!AQ$69,capacity!AQ$101))","v":21.256700335231962},{"$f":"IF($B$20=\"yes\",0,IF($B$17=\"Four pipe\",capacity!AR$69,capacity!AR$101))","v":21.451850474953595},{"$f":"IF($B$20=\"yes\",0,IF($B$17=\"Four pipe\",capacity!AS$69,capacity!AS$101))","v":21.773773528884981},null,{"$f":"IF($B$20=\"yes\",0,IF($B$17=\"Four pipe\",capacity!AT$69,capacity!AT$101))","v":20.975174018402754},{"$f":"IF($B$20=\"yes\",0,IF($B$17=\"Four pipe\",capacity!AU$69,capacity!AU$101))","v":20.992659132923066},{"$f":"IF($B$20=\"yes\",0,IF($B$17=\"Four pipe\",capacity!AV$69,capacity!AV$101))","v":21.290366141556603},{"$f":"IF($B$20=\"yes\",0,IF($B$17=\"Four pipe\",capacity!AW$69,capacity!AW$101))","v":21.699228565714023},null,{"$f":"IF($B$20=\"yes\",0,IF($B$17=\"Four pipe\",capacity!AX$69,capacity!AX$101))","v":20.757161871089259},{"$f":"IF($B$20=\"yes\",0,IF($B$17=\"Four pipe\",capacity!AY$69,capacity!AY$101))","v":20.830847491888633},{"$f":"IF($B$20=\"yes\",0,IF($B$17=\"Four pipe\",capacity!AZ$69,capacity!AZ$101))","v":21.223755708958258},{"$f":"IF($B$20=\"yes\",0,IF($B$17=\"Four pipe\",capacity!BA$69,capacity!BA$101))","v":21.67981350041368}]
[]
[]
[null,null,null,null,"if 0 = Ps realistic / 1000 Ps not realistic",null,null,{"$f":"IF(OR(H24>'instelwaarden & data'!$E$36,H24<'instelwaarden & data'!$E$37,H26>'instelwaarden & data'!$E$38,H50<>\"OK\",H51<>\"OK\"),1000,0)","v":1000},{"$f":"IF(OR(I24>'instelwaarden & data'!$E$36,I24<'instelwaarden & data'!$E$37,I26>'instelwaarden & data'!$E$38,I50<>\"OK\",I51<>\"OK\"),1000,0)","v":1000},{"$f":"IF(OR(J24>'instelwaarden & data'!$E$36,J24<'instelwaarden & data'!$E$37,J26>'instelwaarden & data'!$E$38,J50<>\"OK\",J51<>\"OK\"),1000,0)","v":1000},{"$f":"IF(OR(K24>'instelwaarden & data'!$E$36,K24<'instelwaarden & data'!$E$37,K26>'instelwaarden & data'!$E$38,K50<>\"OK\",K51<>\"OK\"),1000,0)","v":1000},{"$f":"IF(OR(L24>'instelwaarden & data'!$E$36,L24<'instelwaarden & data'!$E$37,L26>'instelwaarden & data'!$E$38,L50<>\"OK\",L51<>\"OK\"),1000,0)","v":1000},{"$f":"IF(OR(M24>'instelwaarden & data'!$E$36,M24<'instelwaarden & data'!$E$37,M26>'instelwaarden & data'!$E$38,M50<>\"OK\",M51<>\"OK\"),1000,0)","v":1000},{"$f":"IF(OR(N24>'instelwaarden & data'!$E$36,N24<'instelwaarden & data'!$E$37,N26>'instelwaarden & data'!$E$38,N50<>\"OK\",N51<>\"OK\"),1000,0)","v":1000},{"$f":"IF(OR(O24>'instelwaarden & data'!$E$36,O24<'instelwaarden & data'!$E$37,O26>'instelwaarden & data'!$E$38,O50<>\"OK\",O51<>\"OK\"),1000,0)","v":1000},{"$f":"IF(OR(P24>'instelwaarden & data'!$E$36,P24<'instelwaarden & data'!$E$37,P26>'instelwaarden & data'!$E$38,P50<>\"OK\",P51<>\"OK\"),1000,0)","v":1000},{"$f":"IF(OR(Q24>'instelwaarden & data'!$E$36,Q24<'instelwaarden & data'!$E$37,Q26>'instelwaarden & data'!$E$38,Q50<>\"OK\",Q51<>\"OK\"),1000,0)","v":1000},{"$f":"IF(OR(R24>'instelwaarden & data'!$E$36,R24<'instelwaarden & data'!$E$37,R26>'instelwaarden & data'!$E$38,R50<>\"OK\",R51<>\"OK\"),1000,0)","v":1000},{"$f":"IF(OR(S24>'instelwaarden & data'!$E$36,S24<'instelwaarden & data'!$E$37,S26>'instelwaarden & data'!$E$38,S50<>\"OK\",S51<>\"OK\"),1000,0)","v":1000},{"$f":"IF(OR(T24>'instelwaarden & data'!$E$36,T24<'instelwaarden & data'!$E$37,T26>'instelwaarden & data'!$E$38,T50<>\"OK\",T51<>\"OK\"),1000,0)","v":1000},{"$f":"IF(OR(U24>'instelwaarden & data'!$E$36,U24<'instelwaarden & data'!$E$37,U26>'instelwaarden & data'!$E$38,U50<>\"OK\",U51<>\"OK\"),1000,0)","v":1000},{"$f":"IF(OR(V24>'instelwaarden & data'!$E$36,V24<'instelwaarden & data'!$E$37,V26>'instelwaarden & data'!$E$38,V50<>\"OK\",V51<>\"OK\"),1000,0)","v":1000},{"$f":"IF(OR(W24>'instelwaarden & data'!$E$36,W24<'instelwaarden & data'!$E$37,W26>'instelwaarden & data'!$E$38,W50<>\"OK\",W51<>\"OK\"),1000,0)","v":1000},{"$f":"IF(OR(X24>'instelwaarden & data'!$E$36,X24<'instelwaarden & data'!$E$37,X26>'instelwaarden & data'!$E$38,X50<>\"OK\",X51<>\"OK\"),1000,0)","v":1000},{"$f":"IF(OR(Y24>'instelwaarden & data'!$E$36,Y24<'instelwaarden & data'!$E$37,Y26>'instelwaarden & data'!$E$38,Y50<>\"OK\",Y51<>\"OK\"),1000,0)","v":1000},{"$f":"IF(OR(Z24>'instelwaarden & data'!$E$36,Z24<'instelwaarden & data'!$E$37,Z26>'instelwaarden & data'!$E$38,Z50<>\"OK\",Z51<>\"OK\"),1000,0)","v":0},{"$f":"IF(OR(AA24>'instelwaarden & data'!$E$36,AA24<'instelwaarden & data'!$E$37,AA26>'instelwaarden & data'!$E$38,AA50<>\"OK\",AA51<>\"OK\"),1000,0)","v":1000},{"$f":"IF(OR(AB24>'instelwaarden & data'!$E$36,AB24<'instelwaarden & data'!$E$37,AB26>'instelwaarden & data'!$E$38,AB50<>\"OK\",AB51<>\"OK\"),1000,0)","v":1000},{"$f":"IF(OR(AC24>'instelwaarden & data'!$E$36,AC24<'instelwaarden & data'!$E$37,AC26>'instelwaarden & data'!$E$38,AC50<>\"OK\",AC51<>\"OK\"),1000,0)","v":1000},{"$f":"IF(OR(AD24>'instelwaarden & data'!$E$36,AD24<'instelwaarden & data'!$E$37,AD26>'instelwaarden & data'!$E$38,AD50<>\"OK\",AD51<>\"OK\"),1000,0)","v":1000},{"$f":"IF(OR(AE24>'instelwaarden & data'!$E$36,AE24<'instelwaarden & data'!$E$37,AE26>'instelwaarden & data'!$E$38,AE50<>\"OK\",AE51<>\"OK\"),1000,0)","v":0},{"$f":"IF(OR(AF24>'instelwaarden & data'!$E$36,AF24<'instelwaarden & data'!$E$37,AF26>'instelwaarden & data'!$E$38,AF50<>\"OK\",AF51<>\"OK\"),1000,0)","v":1000},{"$f":"IF(OR(AG24>'instelwaarden & data'!$E$36,AG24<'instelwaarden & data'!$E$37,AG26>'instelwaarden & data'!$E$38,AG50<>\"OK\",AG51<>\"OK\"),1000,0)","v":1000},{"$f":"IF(OR(AH24>'instelwaarden & data'!$E$36,AH24<'instelwaarden & data'!$E$37,AH26>'instelwaarden & data'!$E$38,AH50<>\"OK\",AH51<>\"OK\"),1000,0)","v":1000},{"$f":"IF(OR(AI24>'instelwaarden & data'!$E$36,AI24<'instelwaarden & data'!$E$37,AI26>'instelwaarden & data'!$E$38,AI50<>\"OK\",AI51<>\"OK\"),1000,0)","v":0},{"$f":"IF(OR(AJ24>'instelwaarden & data'!$E$36,AJ24<'instelwaarden & data'!$E$37,AJ26>'instelwaarden & data'!$E$38,AJ50<>\"OK\",AJ51<>\"OK\"),1000,0)","v":0},{"$f":"IF(OR(AK24>'instelwaarden & data'!$E$36,AK24<'instelwaarden & data'!$E$37,AK26>'instelwaarden & data'!$E$38,AK50<>\"OK\",AK51<>\"OK\"),1000,0)","v":1000},{"$f":"IF(OR(AL24>'instelwaarden & data'!$E$36,AL24<'instelwaarden & data'!$E$37,AL26>'instelwaarden & data'!$E$38,AL50<>\"OK\",AL51<>\"OK\"),1000,0)","v":1000},{"$f":"IF(OR(AM24>'instelwaarden & data'!$E$36,AM24<'instelwaarden & data'!$E$37,AM26>'instelwaarden & data'!$E$38,AM50<>\"OK\",AM51<>\"OK\"),1000,0)","v":1000},{"$f":"IF(OR(AN24>'instelwaarden & data'!$E$36,AN24<'instelwaarden & data'!$E$37,AN26>'instelwaarden & data'!$E$38,AN50<>\"OK\",AN51<>\"OK\"),1000,0)","v":0},{"$f":"IF(OR(AO24>'instelwaarden & data'!$E$36,AO24<'instelwaarden & data'!$E$37,AO26>'instelwaarden & data'!$E$38,AO50<>\"OK\",AO51<>\"OK\"),1000,0)","v":0},{"$f":"IF(OR(AP24>'instelwaarden & data'!$E$36,AP24<'instelwaarden & data'!$E$37,AP26>'instelwaarden & data'!$E$38,AP50<>\"OK\",AP51<>\"OK\"),1000,0)","v":1000},{"$f":"IF(OR(AQ24>'instelwaarden & data'!$E$36,AQ24<'instelwaarden & data'!$E$37,AQ26>'instelwaarden & data'!$E$38,AQ50<>\"OK\",AQ51<>\"OK\"),1000,0)","v":1000},{"$f":"IF(OR(AR24>'instelwaarden & data'!$E$36,AR24<'instelwaarden & data'!$E$37,AR26>'instelwaarden & data'!$E$38,AR50<>\"OK\",AR51<>\"OK\"),1000,0)","v":0},{"$f":"IF(OR(AS24>'instelwaarden & data'!$E$36,AS24<'instelwaarden & data'!$E$37,AS26>'instelwaarden & data'!$E$38,AS50<>\"OK\",AS51<>\"OK\"),1000,0)","v":0},{"$f":"IF(OR(AT24>'instelwaarden & data'!$E$36,AT24<'instelwaarden & data'!$E$37,AT26>'instelwaarden & data'!$E$38,AT50<>\"OK\",AT51<>\"OK\"),1000,0)","v":0},{"$f":"IF(OR(AU24>'instelwaarden & data'!$E$36,AU24<'instelwaarden & data'!$E$37,AU26>'instelwaarden & data'!$E$38,AU50<>\"OK\",AU51<>\"OK\"),1000,0)","v":1000},{"$f":"IF(OR(AV24>'instelwaarden & data'!$E$36,AV24<'instelwaarden & data'!$E$37,AV26>'instelwaarden & data'!$E$38,AV50<>\"OK\",AV51<>\"OK\"),1000,0)","v":1000},{"$f":"IF(OR(AW24>'instelwaarden & data'!$E$36,AW24<'instelwaarden & data'!$E$37,AW26>'instelwaarden & data'!$E$38,AW50<>\"OK\",AW51<>\"OK\"),1000,0)","v":0},{"$f":"IF(OR(AX24>'instelwaarden & data'!$E$36,AX24<'instelwaarden & data'!$E$37,AX26>'instelwaarden & data'!$E$38,AX50<>\"OK\",AX51<>\"OK\"),1000,0)","v":0},{"$f":"IF(OR(AY24>'instelwaarden & data'!$E$36,AY24<'instelwaarden & data'!$E$37,AY26>'instelwaarden & data'!$E$38,AY50<>\"OK\",AY51<>\"OK\"),1000,0)","v":1000},{"$f":"IF(OR(AZ24>'instelwaarden & data'!$E$36,AZ24<'instelwaarden & data'!$E$37,AZ26>'instelwaarden & data'!$E$38,AZ50<>\"OK\",AZ51<>\"OK\"),1000,0)","v":1000},{"$f":"IF(OR(BA24>'instelwaarden & data'!$E$36,BA24<'instelwaarden & data'!$E$37,BA26>'instelwaarden & data'!$E$38,BA50<>\"OK\",BA51<>\"OK\"),1000,0)","v":0},{"$f":"IF(OR(BB24>'instelwaarden & data'!$E$36,BB24<'instelwaarden & data'!$E$37,BB26>'instelwaarden & data'!$E$38,BB50<>\"OK\",BB51<>\"OK\"),1000,0)","v":0},{"$f":"IF(OR(BC24>'instelwaarden & data'!$E$36,BC24<'instelwaarden & data'!$E$37,BC26>'instelwaarden & data'!$E$38,BC50<>\"OK\",BC51<>\"OK\"),1000,0)","v":0},{"$f":"IF(OR(BD24>'instelwaarden & data'!$E$36,BD24<'instelwaarden & data'!$E$37,BD26>'instelwaarden & data'!$E$38,BD50<>\"OK\",BD51<>\"OK\"),1000,0)","v":1000},{"$f":"IF(OR(BE24>'instelwaarden & data'!$E$36,BE24<'instelwaarden & data'!$E$37,BE26>'instelwaarden & data'!$E$38,BE50<>\"OK\",BE51<>\"OK\"),1000,0)","v":1000},{"$f":"IF(OR(BF24>'instelwaarden & data'!$E$36,BF24<'instelwaarden & data'!$E$37,BF26>'instelwaarden & data'!$E$38,BF50<>\"OK\",BF51<>\"OK\"),1000,0)","v":0},{"$f":"IF(OR(BG24>'instelwaarden & data'!$E$36,BG24<'instelwaarden & data'!$E$37,BG26>'instelwaarden & data'!$E$38,BG50<>\"OK\",BG51<>\"OK\"),1000,0)","v":0},{"$f":"IF(OR(BH24>'instelwaarden & data'!$E$36,BH24<'instelwaarden & data'!$E$37,BH26>'instelwaarden & data'!$E$38,BH50<>\"OK\",BH51<>\"OK\"),1000,0)","v":0},{"$f":"IF(OR(BI24>'instelwaarden & data'!$E$36,BI24<'instelwaarden & data'!$E$37,BI26>'instelwaarden & data'!$E$38,BI50<>\"OK\",BI51<>\"OK\"),1000,0)","v":1000}]
[null,null,null,null,null,"error Qw cooling",null,{"$f":"IF(($B$15+H43)<=$B$12,\"OK\",\"error Qw\")","v":"OK"},"OK","OK","OK","OK","OK","OK","OK","OK","OK","OK","OK","OK","OK","OK","OK","OK","OK","OK","OK","OK","OK","OK","OK","OK","OK","OK","OK","OK","OK","OK","OK",{"$f":"IF(($B$15+AN43)<=$B$12,\"OK\",\"error Qw\")","v":"OK"},"OK","OK","OK","OK","OK","OK","OK","OK","OK","OK","OK","OK","OK","OK","OK","OK","OK","OK","OK","OK","OK"]
[null,null,null,null,null,"error Qw heating",null,{"$f":"IF(($C$15-H45)>$C$12,\"OK\",\"error Qw\")","v":"OK"},{"$f":"IF(($C$15-I45)>$C$12,\"OK\",\"error Qw\")","v":"OK"},"OK","OK","OK","OK","OK","OK","OK","OK","OK","OK","OK","OK","OK","OK","OK","OK","OK","OK","OK","OK","OK","OK","OK","OK","OK","OK","OK","OK","OK","OK","OK","OK","OK","OK","OK","OK","OK","OK","OK","OK","OK","OK","OK","OK","OK","OK","OK","OK","OK","OK","OK","OK"]

{"sheet":"physical parameters","index":2,"n_rows":112,"n_cols":10,"rows_kept":112,"cut":false,"hidden":true,"merged":[[26,0,26,15],[20,3,20,4]]}
["Calculation of air density"]
["Constants"]
["Rd","specific gas constant for dry air","J/(kg.K)",287.05799999999999]
["Rv","specific gas constant for water vapor","J/(kg.K)",461.495]
["input data",null,null,"cooling","heating"]
["P","atmospheric pressure","Pa",101325,{"$f":"D6","v":101325},101325]
["T","temperature at working condition","K",{"$f":"selection!B12+273","v":298},{"$f":"capacity!C3+273","v":293},295.03566417910446]
["RelHum","relative humidity","%",50,{"$f":"D8","v":50},50]
["Calculations"]
["Psat","saturation pressure","Pa",{"$f":"610.78*10^((7.5*$D$7-2048.625)/($D$7-35.85))","v":3139.299408516621},{"$f":"610.78*10^((7.5*$D$7-2048.625)/($D$7-35.85))","v":3139.299408516621},2745.3323296895892]
["Pv","partial pressure for water vapor","Pa",{"$f":"D10*(D8/100)","v":1569.6497042583105},{"$f":"E10*(E8/100)","v":1569.6497042583105},1372.6661648447946]
["Pd","partial pressure for dry air","Pa",{"$f":"D6-D11","v":99755.350295741693},{"$f":"E6-E11","v":99755.350295741693},99952.333835155208]
["Result",null,null,"cooling","heating"]
["Rho","density of humid air","kg/m³",{"$f":"D12/($D$3*D7)+D11/($D$4*D7)","v":1.1775524072205275},{"$f":"E12/($D$3*E7)+E11/($D$4*E7)","v":1.1976471581969872}]
[]
["Calculation of air specific heat capacity (ref.: www.ohio.edu/mechanical/thermo/property_tables_air)"]
["Temperature\n[°C]","specific heat capacity\n[J/kg.°C]",null,null,"% fout"]
[-23.15,1.0029999999999999,null,{"$f":"$H$25*A18^2+$I$25*A18+$J$25","v":1.0029811845000001},{"$f":"(B18-D18)/(B18/100)","v":1.8759222332826204E-3}]
[26.85,1.0049999999999999,null,{"$f":"$H$25*A19^2+$I$25*A19+$J$25","v":1.0050181845000001},{"$f":"(B19-D19)/(B19/100)","v":-1.8094029850985157E-3}]
[76.849999999999994,1.008,null,{"$f":"$H$25*A20^2+$I$25*A20+$J$25","v":1.0080551845000001},{"$f":"(B20-D20)/(B20/100)","v":-5.474652777785991E-3}]
[null,null,null,"cp air"]
["Result",null,null,"cooling","heating"]
["find position smaller T",null,null,{"$f":"capacity!B3","v":25},{"$f":"capacity!C3","v":20}]
["Cp","specific heat capacity","J/kg.°C",{"$f":"$H$25*D23^2+$I$25*D23+$J$25","v":1.0049250000000001},{"$f":"$H$25*E23^2+$I$25*E23+$J$25","v":1.00468}]
[null,null,null,null,null,null,null,{"$f":"2*10^-7","v":1.9999999999999999E-7},{"$f":"4*10^-5","v":4.0000000000000003E-5},1.0038]
[]
["WATER"]
[]
[]
["Calculation of water density and specific heat capacity (ref.: www.thermexcel.com/english/tables/eau_atm.html)"]
["Temperature\n[°C]","density\n[kg/m³]","specific heat capacity\n[J/kg.°C]"]
[5,1000,4.202]
[{"$f":"A32+1","v":6},999.99,4.2]
[{"$f":"A33+1","v":7},999.96,4.1980000000000004]
[8,999.91,4.1959999999999997]
[9,999.85,4.194]
[10,999.77,4.0919999999999996]
[11,999.68,4.1909999999999998]
[12,999.58,4.1890000000000001]
[13,999.46,4.1879999999999997]
[14,999.33,4.1870000000000003]
[15,999.19,4.1859999999999999]
[16,999.03,4.1849999999999996]
[17,998.86,4.1840000000000002]
[18,998.68,4.1829999999999998]
[19,998.49,4.1820000000000004]
[20,998.29,4.1820000000000004]
[21,998.08,4.181]
[22,997.86,4.181]
[23,997.62,4.18]
[24,997.38,4.18]
[25,997.13,4.18]
[26,996.86,4.1790000000000003]
[27,996.59,4.1790000000000003]
[28,996.31,4.1790000000000003]
[29,996.02,4.1790000000000003]
[30,995.71,4.1779999999999999]
[31,995.41,4.1779999999999999]
[32,995.09,4.1779999999999999]
[33,994.76,4.1779999999999999]
[34,994.43,4.1779999999999999]
[35,994.08,4.1779999999999999]
[36,993.73,4.1779999999999999]
[37,993.37,4.1779999999999999]
[38,993,4.1779999999999999]
[39,992.63,4.1790000000000003]
[40,992.25,4.1790000000000003]
[41,991.86,4.1790000000000003]
[42,991.46,4.1790000000000003]
[43,991.05,4.1790000000000003]
[44,990.64,4.1790000000000003]
[45,990.22,4.18]
[46,989.8,4.18]
[47,989.36,4.18]
[48,988.92,4.18]
[49,988.47,4.181]
[50,988.02,4.181]
[51,987.56,4.181]
[52,987.09,4.1820000000000004]
[53,986.62,4.1820000000000004]
[54,986.14,4.1820000000000004]
[55,985.65,4.1829999999999998]
[56,985.16,4.1829999999999998]
[57,984.66,4.1829999999999998]
[58,984.16,4.1840000000000002]
[59,983.64,4.1840000000000002]
[60,983.13,4.1849999999999996]
[61,982.6,4.1849999999999996]
[62,982.07,4.1859999999999999]
[63,981.54,4.1859999999999999]
[64,981,4.1870000000000003]
[65,980.45,4.1870000000000003]
[66,979.9,4.1879999999999997]
[67,979.34,4.1879999999999997]
[68,978.78,4.1890000000000001]
[69,978.21,4.1890000000000001]
[70,977.63,4.1900000000000004]
[{"$f":"A97+1","v":71},977.05,4.1900000000000004]
[72,976.47,4.1909999999999998]
[73,975.88,4.1920000000000002]
[74,975.28,4.1920000000000002]
[75,974.68,4.1929999999999996]
[76,974.08,4.194]
[77,973.46,4.194]
[78,972.85,4.1950000000000003]
[79,972.23,4.1959999999999997]
[80,971.6,4.1959999999999997]
[]
["Result",null,null,"cooling","heating"]
["find position smaller T",null,"water temp",{"$f":"capacity!B6","v":14},{"$f":"capacity!C6","v":45}]
["Rho","density of water","kg/m³",{"$f":"VLOOKUP(D110,A32:B107,2,1)","v":999.33},{"$f":"VLOOKUP(E110,A32:C107,2,1)","v":990.22}]
["Cp","specific heat capacity water","J/kg.°C",{"$f":"VLOOKUP(D110,A32:C107,3,1)","v":4.1870000000000003},{"$f":"VLOOKUP(E110,A32:C107,3,1)","v":4.18}]

{"sheet":"configuration","index":3,"n_rows":36,"n_cols":13,"rows_kept":36,"cut":false,"hidden":true,"merged":[[15,4,15,5],[4,1,4,2],[11,4,11,5],[12,4,12,5],[13,4,13,5],[14,4,14,5],[8,0,8,1],[26,4,26,5],[27,4,27,5],[28,4,28,5],[29,4,29,5],[30,4,30,5]]}
[{"$f":"IF('general info'!$F$1=\"NL\",talen!A8,IF('general info'!$F$1=\"FR\",talen!B8,IF('general info'!$F$1=\"EN\",talen!C8,talen!D8)))","v":"Choose nominal beam length:"},{"$f":"selection!G21","v":1800}]
[{"$f":"IF('general info'!$F$1=\"NL\",talen!A17,IF('general info'!$F$1=\"FR\",talen!B17,IF('general info'!$F$1=\"EN\",talen!C17,talen!D17)))","v":"Battery length:"},{"$f":"selection!F21","v":1800}]
[{"$f":"IF($F$1=\"NL\",talen!A18,IF($F$1=\"FR\",talen!B18,IF($F$1=\"EN\",talen!C18,talen!D18)))","v":"Nozzletyp:"},{"$f":"selection!F22","v":"D"},null,null,null," "]
[null,null,null,null,{"$f":"'general info'!B7","v":"Name"},{"$f":"'general info'!C7","v":"Mounting type"},{"$f":"'general info'!D7","v":"Model"},{"$f":"'general info'!E7","v":"Connection"},{"$f":"'general info'!F7","v":"Nozzle"},{"$f":"'general info'!G7","v":"Battery type"},{"$f":"'general info'!H7","v":"Options"},{"$f":"'general info'!I7","v":"Beam length"},{"$f":"'general info'!J7","v":"Battery length"}]
[{"$f":"IF('general info'!$F$1=\"NL\",talen!A45,IF('general info'!$F$1=\"FR\",talen!B45,IF('general info'!$F$1=\"EN\",talen!C45,talen!D45)))","v":"Order code:"},{"$f":"IF(B1>=B2,CONCATENATE(E5,LEFT(F5,1),G5,LEFT(H5,1),I5,LEFT(J5,1),LEFT(K5,1),L5,M5),\"Error  nom length\")","v":"KT6LDH-18001800"},null,null,{"$f":"'general info'!B8","v":"K"},{"$f":"'general info'!C8","v":"T: T-bar"},{"$f":"'general info'!D8","v":6},{"$f":"IF(selection!B13<130,'general info'!E8,IF('general info'!E8='instelwaarden & data'!C4,'instelwaarden & data'!C6,'instelwaarden & data'!C5))","v":"L: left connection"},{"$f":"'general info'!F8","v":"D"},{"$f":"'general info'!G8","v":"H: cooling & heating coil"},{"$f":"'general info'!H8","v":"- : None"},{"$f":"'general info'!I8","v":1800},{"$f":"'general info'!J8","v":1800}]
[]
[]
[]
[{"$f":"IF('general info'!$F$1=\"NL\",talen!A71,IF('general info'!$F$1=\"FR\",talen!B71,IF('general info'!$F$1=\"EN\",talen!C71,talen!D71)))","v":"Selected beam specifications "}]
[]
[{"$f":"IF('general info'!$F$1=\"NL\",talen!A72,IF('general info'!$F$1=\"FR\",talen!B72,IF('general info'!$F$1=\"EN\",talen!C72,talen!D72)))","v":"Calculated data - cooling"},null,null,{"$f":"IF('general info'!$F$1=\"NL\",talen!A66,IF('general info'!$F$1=\"FR\",talen!B66,IF('general info'!$F$1=\"EN\",talen!C66,talen!D66)))","v":"Required"},null,null,{"$f":"IF('general info'!$F$1=\"NL\",talen!A74,IF('general info'!$F$1=\"FR\",talen!B74,IF('general info'!$F$1=\"EN\",talen!C74,talen!D74)))","v":"Input data - cooling"}]
[{"$f":"IF('general info'!$F$1=\"NL\",talen!A18,IF('general info'!$F$1=\"FR\",talen!B18,IF('general info'!$F$1=\"EN\",talen!C18,talen!D18)))","v":"Nozzle type:"},"-",{"$f":"selection!F22","v":"D"},"-",{"$f":"IF('general info'!$F$1=\"NL\",talen!A10,IF('general info'!$F$1=\"FR\",talen!B10,IF('general info'!$F$1=\"EN\",talen!C10,talen!D10)))","v":"Room air temperature:"},null,{"$f":"selection!B12","v":25},"ºC",null,null,{"$f":"selection!A21","v":"cooling only"},{"$f":"selection!B21","v":"No"},{"$f":"selection!C21","v":0}]
[{"$f":"IF('general info'!$F$1=\"NL\",talen!A17,IF('general info'!$F$1=\"FR\",talen!B17,IF('general info'!$F$1=\"EN\",talen!C17,talen!D17)))","v":"Battery length:"},"mm",{"$f":"selection!F21","v":1800},{"$f":"IF(selection!F14=\"\",\"0\",selection!F14)","v":"0"},{"$f":"IF('general info'!$F$1=\"NL\",talen!A11,IF('general info'!$F$1=\"FR\",talen!B11,IF('general info'!$F$1=\"EN\",talen!C11,talen!D11)))","v":"Supply (primary) air flow rate:"},null,{"$f":"selection!B13","v":86.4},"m3/h",null,null,{"$f":"selection!A22","v":"heating only"},{"$f":"selection!B22","v":"No"},{"$f":"selection!C22","v":0}]
[{"$f":"IF('general info'!$F$1=\"NL\",talen!A21,IF('general info'!$F$1=\"FR\",talen!B21,IF('general info'!$F$1=\"EN\",talen!C21,talen!D21)))","v":"Total capacity:"},"W",{"$f":"IF(AND(L13=\"yes\",M13=0),0,IF(AND(C$13=600,C$12=\"A\"),selection!H23,IF(AND(C$13=600,C$12=\"B\"),selection!I23,IF(AND(C$13=600,C$12=\"C\"),selection!J23,IF(AND(C$13=600,C$12=\"D\"),selection!K23,IF(AND(C$13=900,C$12=\"A\"),selection!M23,IF(AND(C$13=900,C$12=\"B\"),selection!N23,IF(AND(C$13=900,C$12=\"C\"),selection!O23,IF(AND(C$13=900,C$12=\"D\"),selection!P23,IF(AND(C$13=1000,C$12=\"A\"),selection!R23,IF(AND(C$13=1000,C$12=\"B\"),selection!S23,IF(AND(C$13=1000,C$12=\"C\"),selection!T23,IF(AND(C$13=1000,C$12=\"D\"),selection!U23,IF(AND(C$13=1100,C$12=\"A\"),selection!W23,IF(AND(C$13=1100,C$12=\"B\"),selection!X23,IF(AND(C$13=1100,C$12=\"C\"),selection!Y23,IF(AND(C$13=1100,C$12=\"D\"),selection!Z23,IF(AND(C$13=1200,C$12=\"A\"),selection!AB23,IF(AND(C$13=1200,C$12=\"B\"),selection!AC23,IF(AND(C$13=1200,C$12=\"C\"),selection!AD23,IF(AND(C$13=1200,C$12=\"D\"),selection!AE23,IF(AND(C$13=1500,C$12=\"A\"),selection!AG23,IF(AND(C$13=1500,C$12=\"B\"),selection!AH23,IF(AND(C$13=1500,C$12=\"C\"),selection!AI23,IF(AND(C$13=1500,C$12=\"D\"),selection!AJ23,IF(AND(C$13=1800,C$12=\"A\"),selection!AL23,IF(AND(C$13=1800,C$12=\"B\"),selection!AM23,IF(AND(C$13=1800,C$12=\"C\"),selection!AN23,IF(AND(C$13=1800,C$12=\"D\"),selection!AO23,IF(AND(C$13=2100,C$12=\"A\"),selection!AQ23,IF(AND(C$13=2100,C$12=\"B\"),selection!AR23,IF(AND(C$13=2100,C$12=\"C\"),selection!AS23,IF(AND(C$13=2100,C$12=\"D\"),selection!AT23,IF(AND(C$13=2400,C$12=\"A\"),selection!AV23,IF(AND(C$13=2400,C$12=\"B\"),selection!AW23,IF(AND(C$13=2400,C$12=\"C\"),selection!AX23,IF(AND(C$13=2400,C$12=\"D\"),selection!AY23,IF(AND(C$13=2700,C$12=\"A\"),selection!BA23,IF(AND(C$13=2700,C$12=\"B\"),selection!BB23,IF(AND(C$13=2700,C$12=\"C\"),selection!BC23,IF(AND(C$13=2700,C$12=\"D\"),selection!BD23,IF(AND(C$13=2950,C$12=\"A\"),selection!BF23,IF(AND(C$13=2950,C$12=\"B\"),selection!BG23,IF(AND(C$13=2950,C$12=\"C\"),selection!BH23,IF(AND(C$13=2950,C$12=\"D\"),selection!BI23)))))))))))))))))))))))))))))))))))))))))))))","v":650.94062997056403},{"$f":"IF(selection!F19=\"\",\"0\",selection!F19)","v":"0"},{"$f":"IF('general info'!$F$1=\"NL\",talen!A12,IF('general info'!$F$1=\"FR\",talen!B12,IF('general info'!$F$1=\"EN\",talen!C12,talen!D12)))","v":"Supply (primary) air temperature:"},null,{"$f":"selection!B14","v":20},"ºC"]
[{"$f":"IF('general info'!$F$1=\"NL\",talen!A24,IF('general info'!$F$1=\"FR\",talen!B24,IF('general info'!$F$1=\"EN\",talen!C24,talen!D24)))","v":"Plenum static pressure:"},"Pa",{"$f":"IF(AND(C$13=600,C$12=\"A\"),selection!H24,IF(AND(C$13=600,C$12=\"B\"),selection!I24,IF(AND(C$13=600,C$12=\"C\"),selection!J24,IF(AND(C$13=600,C$12=\"D\"),selection!K24,IF(AND(C$13=900,C$12=\"A\"),selection!M24,IF(AND(C$13=900,C$12=\"B\"),selection!N24,IF(AND(C$13=900,C$12=\"C\"),selection!O24,IF(AND(C$13=900,C$12=\"D\"),selection!P24,IF(AND(C$13=1000,C$12=\"A\"),selection!R24,IF(AND(C$13=1000,C$12=\"B\"),selection!S24,IF(AND(C$13=1000,C$12=\"C\"),selection!T24,IF(AND(C$13=1000,C$12=\"D\"),selection!U24,IF(AND(C$13=1100,C$12=\"A\"),selection!W24,IF(AND(C$13=1100,C$12=\"B\"),selection!X24,IF(AND(C$13=1100,C$12=\"C\"),selection!Y24,IF(AND(C$13=1100,C$12=\"D\"),selection!Z24,IF(AND(C$13=1200,C$12=\"A\"),selection!AB24,IF(AND(C$13=1200,C$12=\"B\"),selection!AC24,IF(AND(C$13=1200,C$12=\"C\"),selection!AD24,IF(AND(C$13=1200,C$12=\"D\"),selection!AE24,IF(AND(C$13=1500,C$12=\"A\"),selection!AG24,IF(AND(C$13=1500,C$12=\"B\"),selection!AH24,IF(AND(C$13=1500,C$12=\"C\"),selection!AI24,IF(AND(C$13=1500,C$12=\"D\"),selection!AJ24,IF(AND(C$13=1800,C$12=\"A\"),selection!AL24,IF(AND(C$13=1800,C$12=\"B\"),selection!AM24,IF(AND(C$13=1800,C$12=\"C\"),selection!AN24,IF(AND(C$13=1800,C$12=\"D\"),selection!AO24,IF(AND(C$13=2100,C$12=\"A\"),selection!AQ24,IF(AND(C$13=2100,C$12=\"B\"),selection!AR24,IF(AND(C$13=2100,C$12=\"C\"),selection!AS24,IF(AND(C$13=2100,C$12=\"D\"),selection!AT24,IF(AND(C$13=2400,C$12=\"A\"),selection!AV24,IF(AND(C$13=2400,C$12=\"B\"),selection!AW24,IF(AND(C$13=2400,C$12=\"C\"),selection!AX24,IF(AND(C$13=2400,C$12=\"D\"),selection!AY24,IF(AND(C$13=2700,C$12=\"A\"),selection!BA24,IF(AND(C$13=2700,C$12=\"B\"),selection!BB24,IF(AND(C$13=2700,C$12=\"C\"),selection!BC24,IF(AND(C$13=2700,C$12=\"D\"),selection!BD24,IF(AND(C$13=2950,C$12=\"A\"),selection!BF24,IF(AND(C$13=2950,C$12=\"B\"),selection!BG24,IF(AND(C$13=2950,C$12=\"C\"),selection!BH24,IF(AND(C$13=2950,C$12=\"D\"),selection!BI24))))))))))))))))))))))))))))))))))))))))))))","v":49.238623975303348},{"$f":"IF(selection!F18=\"\",\"0\",selection!F18)","v":"0"},{"$f":"IF('general info'!$F$1=\"NL\",talen!A13,IF('general info'!$F$1=\"FR\",talen!B13,IF('general info'!$F$1=\"EN\",talen!C13,talen!D13)))","v":"Water inlet temperature:"},null,{"$f":"selection!B15","v":14},"ºC"]
[{"$f":"IF('general info'!$F$1=\"NL\",talen!A30,IF('general info'!$F$1=\"FR\",talen!B30,IF('general info'!$F$1=\"EN\",talen!C30,talen!D30)))","v":"Room air velocity, V3:"},"m/s",{"$f":"IF(AND(C$13=600,C$12=\"A\"),selection!H40,IF(AND(C$13=600,C$12=\"B\"),selection!I40,IF(AND(C$13=600,C$12=\"C\"),selection!J40,IF(AND(C$13=600,C$12=\"D\"),selection!K40,IF(AND(C$13=900,C$12=\"A\"),selection!M40,IF(AND(C$13=900,C$12=\"B\"),selection!N40,IF(AND(C$13=900,C$12=\"C\"),selection!O40,IF(AND(C$13=900,C$12=\"D\"),selection!P40,IF(AND(C$13=1000,C$12=\"A\"),selection!R40,IF(AND(C$13=1000,C$12=\"B\"),selection!S40,IF(AND(C$13=1000,C$12=\"C\"),selection!T40,IF(AND(C$13=1000,C$12=\"D\"),selection!U40,IF(AND(C$13=1100,C$12=\"A\"),selection!W40,IF(AND(C$13=1100,C$12=\"B\"),selection!X40,IF(AND(C$13=1100,C$12=\"C\"),selection!Y40,IF(AND(C$13=1100,C$12=\"D\"),selection!Z40,IF(AND(C$13=1200,C$12=\"A\"),selection!AB40,IF(AND(C$13=1200,C$12=\"B\"),selection!AC40,IF(AND(C$13=1200,C$12=\"C\"),selection!AD40,IF(AND(C$13=1200,C$12=\"D\"),selection!AE40,IF(AND(C$13=1500,C$12=\"A\"),selection!AG40,IF(AND(C$13=1500,C$12=\"B\"),selection!AH40,IF(AND(C$13=1500,C$12=\"C\"),selection!AI40,IF(AND(C$13=1500,C$12=\"D\"),selection!AJ40,IF(AND(C$13=1800,C$12=\"A\"),selection!AL40,IF(AND(C$13=1800,C$12=\"B\"),selection!AM40,IF(AND(C$13=1800,C$12=\"C\"),selection!AN40,IF(AND(C$13=1800,C$12=\"D\"),selection!AO40,IF(AND(C$13=2100,C$12=\"A\"),selection!AQ40,IF(AND(C$13=2100,C$12=\"B\"),selection!AR40,IF(AND(C$13=2100,C$12=\"C\"),selection!AS40,IF(AND(C$13=2100,C$12=\"D\"),selection!AT40,IF(AND(C$13=2400,C$12=\"A\"),selection!AV40,IF(AND(C$13=2400,C$12=\"B\"),selection!AW40,IF(AND(C$13=2400,C$12=\"C\"),selection!AX40,IF(AND(C$13=2400,C$12=\"D\"),selection!AY40,IF(AND(C$13=2700,C$12=\"A\"),selection!BA40,IF(AND(C$13=2700,C$12=\"B\"),selection!BB40,IF(AND(C$13=2700,C$12=\"C\"),selection!BC40,IF(AND(C$13=2700,C$12=\"D\"),selection!BD40,IF(AND(C$13=2950,C$12=\"A\"),selection!BF40,IF(AND(C$13=2950,C$12=\"B\"),selection!BG40,IF(AND(C$13=2950,C$12=\"C\"),selection!BH40,IF(AND(C$13=2950,C$12=\"D\"),selection!BI40))))))))))))))))))))))))))))))))))))))))))))","v":0.31484410401935237},{"$f":"IF(selection!F15=\"\",\"0\",selection!F15)","v":"0"},{"$f":"IF('general info'!$F$1=\"NL\",talen!A14,IF('general info'!$F$1=\"FR\",talen!B14,IF('general info'!$F$1=\"EN\",talen!C14,talen!D14)))","v":"Water flow rate :"},null,{"$f":"IF(AND(L13=\"yes\",M13=0),0,selection!B16)","v":100},"l/h"]
[{"$f":"IF('general info'!$F$1=\"NL\",talen!A16,IF('general info'!$F$1=\"FR\",talen!B16,IF('general info'!$F$1=\"EN\",talen!C16,talen!D16)))","v":"Temperature difference battery:"},"ºC",{"$f":"IF(AND(L13=\"yes\",M13=0),0,IF(AND(C$13=600,C$12=\"A\"),selection!H43,IF(AND(C$13=600,C$12=\"B\"),selection!I43,IF(AND(C$13=600,C$12=\"C\"),selection!J43,IF(AND(C$13=600,C$12=\"D\"),selection!K43,IF(AND(C$13=900,C$12=\"A\"),selection!M43,IF(AND(C$13=900,C$12=\"B\"),selection!N43,IF(AND(C$13=900,C$12=\"C\"),selection!O43,IF(AND(C$13=900,C$12=\"D\"),selection!P43,IF(AND(C$13=1000,C$12=\"A\"),selection!R43,IF(AND(C$13=1000,C$12=\"B\"),selection!S43,IF(AND(C$13=1000,C$12=\"C\"),selection!T43,IF(AND(C$13=1000,C$12=\"D\"),selection!U43,IF(AND(C$13=1100,C$12=\"A\"),selection!W43,IF(AND(C$13=1100,C$12=\"B\"),selection!X43,IF(AND(C$13=1100,C$12=\"C\"),selection!Y43,IF(AND(C$13=1100,C$12=\"D\"),selection!Z43,IF(AND(C$13=1200,C$12=\"A\"),selection!AB43,IF(AND(C$13=1200,C$12=\"B\"),selection!AC43,IF(AND(C$13=1200,C$12=\"C\"),selection!AD43,IF(AND(C$13=1200,C$12=\"D\"),selection!AE43,IF(AND(C$13=1500,C$12=\"A\"),selection!AG43,IF(AND(C$13=1500,C$12=\"B\"),selection!AH43,IF(AND(C$13=1500,C$12=\"C\"),selection!AI43,IF(AND(C$13=1500,C$12=\"D\"),selection!AJ43,IF(AND(C$13=1800,C$12=\"A\"),selection!AL43,IF(AND(C$13=1800,C$12=\"B\"),selection!AM43,IF(AND(C$13=1800,C$12=\"C\"),selection!AN43,IF(AND(C$13=1800,C$12=\"D\"),selection!AO43,IF(AND(C$13=2100,C$12=\"A\"),selection!AQ43,IF(AND(C$13=2100,C$12=\"B\"),selection!AR43,IF(AND(C$13=2100,C$12=\"C\"),selection!AS43,IF(AND(C$13=2100,C$12=\"D\"),selection!AT43,IF(AND(C$13=2400,C$12=\"A\"),selection!AV43,IF(AND(C$13=2400,C$12=\"B\"),selection!AW43,IF(AND(C$13=2400,C$12=\"C\"),selection!AX43,IF(AND(C$13=2400,C$12=\"D\"),selection!AY43,IF(AND(C$13=2700,C$12=\"A\"),selection!BA43,IF(AND(C$13=2700,C$12=\"B\"),selection!BB43,IF(AND(C$13=2700,C$12=\"C\"),selection!BC43,IF(AND(C$13=2700,C$12=\"D\"),selection!BD43,IF(AND(C$13=2950,C$12=\"A\"),selection!BF43,IF(AND(C$13=2950,C$12=\"B\"),selection!BG43,IF(AND(C$13=2950,C$12=\"C\"),selection!BH43,IF(AND(C$13=2950,C$12=\"D\"),selection!BI43)))))))))))))))))))))))))))))))))))))))))))))","v":4.3788073798151714},{"$f":"IF(selection!F17=\"\",\"0\",selection!F17)","v":"0"}]
[{"$f":"IF('general info'!$F$1=\"NL\",talen!A35,IF('general info'!$F$1=\"FR\",talen!B35,IF('general info'!$F$1=\"EN\",talen!C35,talen!D35)))","v":"Water capacity:"},"W",{"$f":"IF(AND(L13=\"yes\",M13=0),0,IF(AND(C$13=600,C$12=\"A\"),selection!H27,IF(AND(C$13=600,C$12=\"B\"),selection!I27,IF(AND(C$13=600,C$12=\"C\"),selection!J27,IF(AND(C$13=600,C$12=\"D\"),selection!K27,IF(AND(C$13=900,C$12=\"A\"),selection!M27,IF(AND(C$13=900,C$12=\"B\"),selection!N27,IF(AND(C$13=900,C$12=\"C\"),selection!O27,IF(AND(C$13=900,C$12=\"D\"),selection!P27,IF(AND(C$13=1000,C$12=\"A\"),selection!R27,IF(AND(C$13=1000,C$12=\"B\"),selection!S27,IF(AND(C$13=1000,C$12=\"C\"),selection!T27,IF(AND(C$13=1000,C$12=\"D\"),selection!U27,IF(AND(C$13=1100,C$12=\"A\"),selection!W27,IF(AND(C$13=1100,C$12=\"B\"),selection!X27,IF(AND(C$13=1100,C$12=\"C\"),selection!Y27,IF(AND(C$13=1100,C$12=\"D\"),selection!Z27,IF(AND(C$13=1200,C$12=\"A\"),selection!AB27,IF(AND(C$13=1200,C$12=\"B\"),selection!AC27,IF(AND(C$13=1200,C$12=\"C\"),selection!AD27,IF(AND(C$13=1200,C$12=\"D\"),selection!AE27,IF(AND(C$13=1500,C$12=\"A\"),selection!AG27,IF(AND(C$13=1500,C$12=\"B\"),selection!AH27,IF(AND(C$13=1500,C$12=\"C\"),selection!AI27,IF(AND(C$13=1500,C$12=\"D\"),selection!AJ27,IF(AND(C$13=1800,C$12=\"A\"),selection!AL27,IF(AND(C$13=1800,C$12=\"B\"),selection!AM27,IF(AND(C$13=1800,C$12=\"C\"),selection!AN27,IF(AND(C$13=1800,C$12=\"D\"),selection!AO27,IF(AND(C$13=2100,C$12=\"A\"),selection!AQ27,IF(AND(C$13=2100,C$12=\"B\"),selection!AR27,IF(AND(C$13=2100,C$12=\"C\"),selection!AS27,IF(AND(C$13=2100,C$12=\"D\"),selection!AT27,IF(AND(C$13=2400,C$12=\"A\"),selection!AV27,IF(AND(C$13=2400,C$12=\"B\"),selection!AW27,IF(AND(C$13=2400,C$12=\"C\"),selection!AX27,IF(AND(C$13=2400,C$12=\"D\"),selection!AY27,IF(AND(C$13=2700,C$12=\"A\"),selection!BA27,IF(AND(C$13=2700,C$12=\"B\"),selection!BB27,IF(AND(C$13=2700,C$12=\"C\"),selection!BC27,IF(AND(C$13=2700,C$12=\"D\"),selection!BD27,IF(AND(C$13=2950,C$12=\"A\"),selection!BF27,IF(AND(C$13=2950,C$12=\"B\"),selection!BG27,IF(AND(C$13=2950,C$12=\"C\"),selection!BH27,IF(AND(C$13=2950,C$12=\"D\"),selection!BI27)))))))))))))))))))))))))))))))))))))))))))))","v":508.93840763143334}]
[{"$f":"IF('general info'!$F$1=\"NL\",talen!A19,IF('general info'!$F$1=\"FR\",talen!B19,IF('general info'!$F$1=\"EN\",talen!C19,talen!D19)))","v":"Supply (primary) air capacity:"},"W",{"$f":"IF(AND(L13=\"yes\",M13=0),0,IF(AND(C$13=600,C$12=\"A\"),selection!H28,IF(AND(C$13=600,C$12=\"B\"),selection!I28,IF(AND(C$13=600,C$12=\"C\"),selection!J28,IF(AND(C$13=600,C$12=\"D\"),selection!K28,IF(AND(C$13=900,C$12=\"A\"),selection!M28,IF(AND(C$13=900,C$12=\"B\"),selection!N28,IF(AND(C$13=900,C$12=\"C\"),selection!O28,IF(AND(C$13=900,C$12=\"D\"),selection!P28,IF(AND(C$13=1000,C$12=\"A\"),selection!R28,IF(AND(C$13=1000,C$12=\"B\"),selection!S28,IF(AND(C$13=1000,C$12=\"C\"),selection!T28,IF(AND(C$13=1000,C$12=\"D\"),selection!U28,IF(AND(C$13=1100,C$12=\"A\"),selection!W28,IF(AND(C$13=1100,C$12=\"B\"),selection!X28,IF(AND(C$13=1100,C$12=\"C\"),selection!Y28,IF(AND(C$13=1100,C$12=\"D\"),selection!Z28,IF(AND(C$13=1200,C$12=\"A\"),selection!AB28,IF(AND(C$13=1200,C$12=\"B\"),selection!AC28,IF(AND(C$13=1200,C$12=\"C\"),selection!AD28,IF(AND(C$13=1200,C$12=\"D\"),selection!AE28,IF(AND(C$13=1500,C$12=\"A\"),selection!AG28,IF(AND(C$13=1500,C$12=\"B\"),selection!AH28,IF(AND(C$13=1500,C$12=\"C\"),selection!AI28,IF(AND(C$13=1500,C$12=\"D\"),selection!AJ28,IF(AND(C$13=1800,C$12=\"A\"),selection!AL28,IF(AND(C$13=1800,C$12=\"B\"),selection!AM28,IF(AND(C$13=1800,C$12=\"C\"),selection!AN28,IF(AND(C$13=1800,C$12=\"D\"),selection!AO28,IF(AND(C$13=2100,C$12=\"A\"),selection!AQ28,IF(AND(C$13=2100,C$12=\"B\"),selection!AR28,IF(AND(C$13=2100,C$12=\"C\"),selection!AS28,IF(AND(C$13=2100,C$12=\"D\"),selection!AT28,IF(AND(C$13=2400,C$12=\"A\"),selection!AV28,IF(AND(C$13=2400,C$12=\"B\"),selection!AW28,IF(AND(C$13=2400,C$12=\"C\"),selection!AX28,IF(AND(C$13=2400,C$12=\"D\"),selection!AY28,IF(AND(C$13=2700,C$12=\"A\"),selection!BA28,IF(AND(C$13=2700,C$12=\"B\"),selection!BB28,IF(AND(C$13=2700,C$12=\"C\"),selection!BC28,IF(AND(C$13=2700,C$12=\"D\"),selection!BD28,IF(AND(C$13=2950,C$12=\"A\"),selection!BF28,IF(AND(C$13=2950,C$12=\"B\"),selection!BG28,IF(AND(C$13=2950,C$12=\"C\"),selection!BH28,IF(AND(C$13=2950,C$12=\"D\"),selection!BI28)))))))))))))))))))))))))))))))))))))))))))))","v":142.00222233913064}]
[{"$f":"IF('general info'!$F$1=\"NL\",talen!A23,IF('general info'!$F$1=\"FR\",talen!B23,IF('general info'!$F$1=\"EN\",talen!C23,talen!D23)))","v":"Water pressure drop:"},"kPa",{"$f":"IF(AND(L13=\"yes\",M13=0),0,IF(AND(C$13=600,C$12=\"A\"),selection!H26,IF(AND(C$13=600,C$12=\"B\"),selection!I26,IF(AND(C$13=600,C$12=\"C\"),selection!J26,IF(AND(C$13=600,C$12=\"D\"),selection!K26,IF(AND(C$13=900,C$12=\"A\"),selection!M26,IF(AND(C$13=900,C$12=\"B\"),selection!N26,IF(AND(C$13=900,C$12=\"C\"),selection!O26,IF(AND(C$13=900,C$12=\"D\"),selection!P26,IF(AND(C$13=1000,C$12=\"A\"),selection!R26,IF(AND(C$13=1000,C$12=\"B\"),selection!S26,IF(AND(C$13=1000,C$12=\"C\"),selection!T26,IF(AND(C$13=1000,C$12=\"D\"),selection!U26,IF(AND(C$13=1100,C$12=\"A\"),selection!W26,IF(AND(C$13=1100,C$12=\"B\"),selection!X26,IF(AND(C$13=1100,C$12=\"C\"),selection!Y26,IF(AND(C$13=1100,C$12=\"D\"),selection!Z26,IF(AND(C$13=1200,C$12=\"A\"),selection!AB26,IF(AND(C$13=1200,C$12=\"B\"),selection!AC26,IF(AND(C$13=1200,C$12=\"C\"),selection!AD26,IF(AND(C$13=1200,C$12=\"D\"),selection!AE26,IF(AND(C$13=1500,C$12=\"A\"),selection!AG26,IF(AND(C$13=1500,C$12=\"B\"),selection!AH26,IF(AND(C$13=1500,C$12=\"C\"),selection!AI26,IF(AND(C$13=1500,C$12=\"D\"),selection!AJ26,IF(AND(C$13=1800,C$12=\"A\"),selection!AL26,IF(AND(C$13=1800,C$12=\"B\"),selection!AM26,IF(AND(C$13=1800,C$12=\"C\"),selection!AN26,IF(AND(C$13=1800,C$12=\"D\"),selection!AO26,IF(AND(C$13=2100,C$12=\"A\"),selection!AQ26,IF(AND(C$13=2100,C$12=\"B\"),selection!AR26,IF(AND(C$13=2100,C$12=\"C\"),selection!AS26,IF(AND(C$13=2100,C$12=\"D\"),selection!AT26,IF(AND(C$13=2400,C$12=\"A\"),selection!AV26,IF(AND(C$13=2400,C$12=\"B\"),selection!AW26,IF(AND(C$13=2400,C$12=\"C\"),selection!AX26,IF(AND(C$13=2400,C$12=\"D\"),selection!AY26,IF(AND(C$13=2700,C$12=\"A\"),selection!BA26,IF(AND(C$13=2700,C$12=\"B\"),selection!BB26,IF(AND(C$13=2700,C$12=\"C\"),selection!BC26,IF(AND(C$13=2700,C$12=\"D\"),selection!BD26,IF(AND(C$13=2950,C$12=\"A\"),selection!BF26,IF(AND(C$13=2950,C$12=\"B\"),selection!BG26,IF(AND(C$13=2950,C$12=\"C\"),selection!BH26,IF(AND(C$13=2950,C$12=\"D\"),selection!BI26)))))))))))))))))))))))))))))))))))))))))))))","v":0.57920032115274711}]
[{"$f":"IF('general info'!$F$1=\"NL\",talen!A25,IF('general info'!$F$1=\"FR\",talen!B25,IF('general info'!$F$1=\"EN\",talen!C25,talen!D25)))","v":"Sound level (excl. room attenuation):"},"dB(A)",{"$f":"IF(AND(C$13=600,C$12=\"A\"),selection!H25,IF(AND(C$13=600,C$12=\"B\"),selection!I25,IF(AND(C$13=600,C$12=\"C\"),selection!J25,IF(AND(C$13=600,C$12=\"D\"),selection!K25,IF(AND(C$13=900,C$12=\"A\"),selection!M25,IF(AND(C$13=900,C$12=\"B\"),selection!N25,IF(AND(C$13=900,C$12=\"C\"),selection!O25,IF(AND(C$13=900,C$12=\"D\"),selection!P25,IF(AND(C$13=1000,C$12=\"A\"),selection!R25,IF(AND(C$13=1000,C$12=\"B\"),selection!S25,IF(AND(C$13=1000,C$12=\"C\"),selection!T25,IF(AND(C$13=1000,C$12=\"D\"),selection!U25,IF(AND(C$13=1100,C$12=\"A\"),selection!W25,IF(AND(C$13=1100,C$12=\"B\"),selection!X25,IF(AND(C$13=1100,C$12=\"C\"),selection!Y25,IF(AND(C$13=1100,C$12=\"D\"),selection!Z25,IF(AND(C$13=1200,C$12=\"A\"),selection!AB25,IF(AND(C$13=1200,C$12=\"B\"),selection!AC25,IF(AND(C$13=1200,C$12=\"C\"),selection!AD25,IF(AND(C$13=1200,C$12=\"D\"),selection!AE25,IF(AND(C$13=1500,C$12=\"A\"),selection!AG25,IF(AND(C$13=1500,C$12=\"B\"),selection!AH25,IF(AND(C$13=1500,C$12=\"C\"),selection!AI25,IF(AND(C$13=1500,C$12=\"D\"),selection!AJ25,IF(AND(C$13=1800,C$12=\"A\"),selection!AL25,IF(AND(C$13=1800,C$12=\"B\"),selection!AM25,IF(AND(C$13=1800,C$12=\"C\"),selection!AN25,IF(AND(C$13=1800,C$12=\"D\"),selection!AO25,IF(AND(C$13=2100,C$12=\"A\"),selection!AQ25,IF(AND(C$13=2100,C$12=\"B\"),selection!AR25,IF(AND(C$13=2100,C$12=\"C\"),selection!AS25,IF(AND(C$13=2100,C$12=\"D\"),selection!AT25,IF(AND(C$13=2400,C$12=\"A\"),selection!AV25,IF(AND(C$13=2400,C$12=\"B\"),selection!AW25,IF(AND(C$13=2400,C$12=\"C\"),selection!AX25,IF(AND(C$13=2400,C$12=\"D\"),selection!AY25,IF(AND(C$13=2700,C$12=\"A\"),selection!BA25,IF(AND(C$13=2700,C$12=\"B\"),selection!BB25,IF(AND(C$13=2700,C$12=\"C\"),selection!BC25,IF(AND(C$13=2700,C$12=\"D\"),selection!BD25,IF(AND(C$13=2950,C$12=\"A\"),selection!BF25,IF(AND(C$13=2950,C$12=\"B\"),selection!BG25,IF(AND(C$13=2950,C$12=\"C\"),selection!BH25,IF(AND(C$13=2950,C$12=\"D\"),selection!BI25))))))))))))))))))))))))))))))))))))))))))))","v":25.973219914659854}]
[{"$f":"IF('general info'!$F$1=\"NL\",talen!A27,IF('general info'!$F$1=\"FR\",talen!B27,IF('general info'!$F$1=\"EN\",talen!C27,talen!D27)))","v":"Mean temperature difference air-water:"},"Dq",{"$f":"IF(AND(C$13=600,C$12=\"A\"),selection!H44,IF(AND(C$13=600,C$12=\"B\"),selection!I44,IF(AND(C$13=600,C$12=\"C\"),selection!J44,IF(AND(C$13=600,C$12=\"D\"),selection!K44,IF(AND(C$13=900,C$12=\"A\"),selection!M44,IF(AND(C$13=900,C$12=\"B\"),selection!N44,IF(AND(C$13=900,C$12=\"C\"),selection!O44,IF(AND(C$13=900,C$12=\"D\"),selection!P44,IF(AND(C$13=1000,C$12=\"A\"),selection!R44,IF(AND(C$13=1000,C$12=\"B\"),selection!S44,IF(AND(C$13=1000,C$12=\"C\"),selection!T44,IF(AND(C$13=1000,C$12=\"D\"),selection!U44,IF(AND(C$13=1100,C$12=\"A\"),selection!W44,IF(AND(C$13=1100,C$12=\"B\"),selection!X44,IF(AND(C$13=1100,C$12=\"C\"),selection!Y44,IF(AND(C$13=1100,C$12=\"D\"),selection!Z44,IF(AND(C$13=1200,C$12=\"A\"),selection!AB44,IF(AND(C$13=1200,C$12=\"B\"),selection!AC44,IF(AND(C$13=1200,C$12=\"C\"),selection!AD44,IF(AND(C$13=1200,C$12=\"D\"),selection!AE44,IF(AND(C$13=1500,C$12=\"A\"),selection!AG44,IF(AND(C$13=1500,C$12=\"B\"),selection!AH44,IF(AND(C$13=1500,C$12=\"C\"),selection!AI44,IF(AND(C$13=1500,C$12=\"D\"),selection!AJ44,IF(AND(C$13=1800,C$12=\"A\"),selection!AL44,IF(AND(C$13=1800,C$12=\"B\"),selection!AM44,IF(AND(C$13=1800,C$12=\"C\"),selection!AN44,IF(AND(C$13=1800,C$12=\"D\"),selection!AO44,IF(AND(C$13=2100,C$12=\"A\"),selection!AQ44,IF(AND(C$13=2100,C$12=\"B\"),selection!AR44,IF(AND(C$13=2100,C$12=\"C\"),selection!AS44,IF(AND(C$13=2100,C$12=\"D\"),selection!AT44,IF(AND(C$13=2400,C$12=\"A\"),selection!AV44,IF(AND(C$13=2400,C$12=\"B\"),selection!AW44,IF(AND(C$13=2400,C$12=\"C\"),selection!AX44,IF(AND(C$13=2400,C$12=\"D\"),selection!AY44,IF(AND(C$13=2700,C$12=\"A\"),selection!BA44,IF(AND(C$13=2700,C$12=\"B\"),selection!BB44,IF(AND(C$13=2700,C$12=\"C\"),selection!BC44,IF(AND(C$13=2700,C$12=\"D\"),selection!BD44,IF(AND(C$13=2950,C$12=\"A\"),selection!BF44,IF(AND(C$13=2950,C$12=\"B\"),selection!BG44,IF(AND(C$13=2950,C$12=\"C\"),selection!BH44,IF(AND(C$13=2950,C$12=\"D\"),selection!BI44))))))))))))))))))))))))))))))))))))))))))))","v":8.8105963100924143}]
[{"$f":"IF('general info'!$F$1=\"NL\",talen!A28,IF('general info'!$F$1=\"FR\",talen!B28,IF('general info'!$F$1=\"EN\",talen!C28,talen!D28)))","v":"Room air velocity, V1:"},"m/s",{"$f":"IF(AND(C$13=600,C$12=\"A\"),selection!H38,IF(AND(C$13=600,C$12=\"B\"),selection!I38,IF(AND(C$13=600,C$12=\"C\"),selection!J38,IF(AND(C$13=600,C$12=\"D\"),selection!K38,IF(AND(C$13=900,C$12=\"A\"),selection!M38,IF(AND(C$13=900,C$12=\"B\"),selection!N38,IF(AND(C$13=900,C$12=\"C\"),selection!O38,IF(AND(C$13=900,C$12=\"D\"),selection!P38,IF(AND(C$13=1000,C$12=\"A\"),selection!R38,IF(AND(C$13=1000,C$12=\"B\"),selection!S38,IF(AND(C$13=1000,C$12=\"C\"),selection!T38,IF(AND(C$13=1000,C$12=\"D\"),selection!U38,IF(AND(C$13=1100,C$12=\"A\"),selection!W38,IF(AND(C$13=1100,C$12=\"B\"),selection!X38,IF(AND(C$13=1100,C$12=\"C\"),selection!Y38,IF(AND(C$13=1100,C$12=\"D\"),selection!Z38,IF(AND(C$13=1200,C$12=\"A\"),selection!AB38,IF(AND(C$13=1200,C$12=\"B\"),selection!AC38,IF(AND(C$13=1200,C$12=\"C\"),selection!AD38,IF(AND(C$13=1200,C$12=\"D\"),selection!AE38,IF(AND(C$13=1500,C$12=\"A\"),selection!AG38,IF(AND(C$13=1500,C$12=\"B\"),selection!AH38,IF(AND(C$13=1500,C$12=\"C\"),selection!AI38,IF(AND(C$13=1500,C$12=\"D\"),selection!AJ38,IF(AND(C$13=1800,C$12=\"A\"),selection!AL38,IF(AND(C$13=1800,C$12=\"B\"),selection!AM38,IF(AND(C$13=1800,C$12=\"C\"),selection!AN38,IF(AND(C$13=1800,C$12=\"D\"),selection!AO38,IF(AND(C$13=2100,C$12=\"A\"),selection!AQ38,IF(AND(C$13=2100,C$12=\"B\"),selection!AR38,IF(AND(C$13=2100,C$12=\"C\"),selection!AS38,IF(AND(C$13=2100,C$12=\"D\"),selection!AT38,IF(AND(C$13=2400,C$12=\"A\"),selection!AV38,IF(AND(C$13=2400,C$12=\"B\"),selection!AW38,IF(AND(C$13=2400,C$12=\"C\"),selection!AX38,IF(AND(C$13=2400,C$12=\"D\"),selection!AY38,IF(AND(C$13=2700,C$12=\"A\"),selection!BA38,IF(AND(C$13=2700,C$12=\"B\"),selection!BB38,IF(AND(C$13=2700,C$12=\"C\"),selection!BC38,IF(AND(C$13=2700,C$12=\"D\"),selection!BD38,IF(AND(C$13=2950,C$12=\"A\"),selection!BF38,IF(AND(C$13=2950,C$12=\"B\"),selection!BG38,IF(AND(C$13=2950,C$12=\"C\"),selection!BH38,IF(AND(C$13=2950,C$12=\"D\"),selection!BI38))))))))))))))))))))))))))))))))))))))))))))","v":5.5167733771901081E-2}]
[{"$f":"IF('general info'!$F$1=\"NL\",talen!A29,IF('general info'!$F$1=\"FR\",talen!B29,IF('general info'!$F$1=\"EN\",talen!C29,talen!D29)))","v":"Room air velocity, V2:"},"m/s",{"$f":"IF(AND(C$13=600,C$12=\"A\"),selection!H39,IF(AND(C$13=600,C$12=\"B\"),selection!I39,IF(AND(C$13=600,C$12=\"C\"),selection!J39,IF(AND(C$13=600,C$12=\"D\"),selection!K39,IF(AND(C$13=900,C$12=\"A\"),selection!M39,IF(AND(C$13=900,C$12=\"B\"),selection!N39,IF(AND(C$13=900,C$12=\"C\"),selection!O39,IF(AND(C$13=900,C$12=\"D\"),selection!P39,IF(AND(C$13=1000,C$12=\"A\"),selection!R39,IF(AND(C$13=1000,C$12=\"B\"),selection!S39,IF(AND(C$13=1000,C$12=\"C\"),selection!T39,IF(AND(C$13=1000,C$12=\"D\"),selection!U39,IF(AND(C$13=1100,C$12=\"A\"),selection!W39,IF(AND(C$13=1100,C$12=\"B\"),selection!X39,IF(AND(C$13=1100,C$12=\"C\"),selection!Y39,IF(AND(C$13=1100,C$12=\"D\"),selection!Z39,IF(AND(C$13=1200,C$12=\"A\"),selection!AB39,IF(AND(C$13=1200,C$12=\"B\"),selection!AC39,IF(AND(C$13=1200,C$12=\"C\"),selection!AD39,IF(AND(C$13=1200,C$12=\"D\"),selection!AE39,IF(AND(C$13=1500,C$12=\"A\"),selection!AG39,IF(AND(C$13=1500,C$12=\"B\"),selection!AH39,IF(AND(C$13=1500,C$12=\"C\"),selection!AI39,IF(AND(C$13=1500,C$12=\"D\"),selection!AJ39,IF(AND(C$13=1800,C$12=\"A\"),selection!AL39,IF(AND(C$13=1800,C$12=\"B\"),selection!AM39,IF(AND(C$13=1800,C$12=\"C\"),selection!AN39,IF(AND(C$13=1800,C$12=\"D\"),selection!AO39,IF(AND(C$13=2100,C$12=\"A\"),selection!AQ39,IF(AND(C$13=2100,C$12=\"B\"),selection!AR39,IF(AND(C$13=2100,C$12=\"C\"),selection!AS39,IF(AND(C$13=2100,C$12=\"D\"),selection!AT39,IF(AND(C$13=2400,C$12=\"A\"),selection!AV39,IF(AND(C$13=2400,C$12=\"B\"),selection!AW39,IF(AND(C$13=2400,C$12=\"C\"),selection!AX39,IF(AND(C$13=2400,C$12=\"D\"),selection!AY39,IF(AND(C$13=2700,C$12=\"A\"),selection!BA39,IF(AND(C$13=2700,C$12=\"B\"),selection!BB39,IF(AND(C$13=2700,C$12=\"C\"),selection!BC39,IF(AND(C$13=2700,C$12=\"D\"),selection!BD39,IF(AND(C$13=2950,C$12=\"A\"),selection!BF39,IF(AND(C$13=2950,C$12=\"B\"),selection!BG39,IF(AND(C$13=2950,C$12=\"C\"),selection!BH39,IF(AND(C$13=2950,C$12=\"D\"),selection!BI39))))))))))))))))))))))))))))))))))))))))))))","v":5.9895954329684128E-2}]
[]
[{"$f":"IF('general info'!$F$1=\"NL\",talen!A73,IF('general info'!$F$1=\"FR\",talen!B73,IF('general info'!$F$1=\"EN\",talen!C73,talen!D73)))","v":"Calculated data - heating"},null,null,{"$f":"IF('general info'!$F$1=\"NL\",talen!A66,IF('general info'!$F$1=\"FR\",talen!B66,IF('general info'!$F$1=\"EN\",talen!C66,talen!D66)))","v":"Required"},null,null,{"$f":"IF('general info'!$F$1=\"NL\",talen!A75,IF('general info'!$F$1=\"FR\",talen!B75,IF('general info'!$F$1=\"EN\",talen!C75,talen!D75)))","v":"Input data - heating"}]
[{"$f":"A12","v":"Nozzle type:"},"-",{"$f":"IF(selection!B20=\"H\",selection!F22,0)","v":0},"-",{"$f":"E12","v":"Room air temperature:"},null,{"$f":"selection!C12","v":20},"ºC"]
[{"$f":"A13","v":"Battery length:"},"mm",{"$f":"selection!F21","v":1800},{"$f":"IF(selection!F14=\"\",\"0\",selection!F14)","v":"0"},{"$f":"E13","v":"Supply (primary) air flow rate:"},null,{"$f":"selection!C13","v":86.4},"m3/h"]
[{"$f":"A14","v":"Total capacity:"},"W",{"$f":"IF(AND(L12=\"yes\",M12=0),0,IF(AND(C$13=600,C$12=\"A\"),selection!H30,IF(AND(C$13=600,C$12=\"B\"),selection!I30,IF(AND(C$13=600,C$12=\"C\"),selection!J30,IF(AND(C$13=600,C$12=\"D\"),selection!K30,IF(AND(C$13=900,C$12=\"A\"),selection!M30,IF(AND(C$13=900,C$12=\"B\"),selection!N30,IF(AND(C$13=900,C$12=\"C\"),selection!O30,IF(AND(C$13=900,C$12=\"D\"),selection!P30,IF(AND(C$13=1000,C$12=\"A\"),selection!R30,IF(AND(C$13=1000,C$12=\"B\"),selection!S30,IF(AND(C$13=1000,C$12=\"C\"),selection!T30,IF(AND(C$13=1000,C$12=\"D\"),selection!U30,IF(AND(C$13=1100,C$12=\"A\"),selection!W30,IF(AND(C$13=1100,C$12=\"B\"),selection!X30,IF(AND(C$13=1100,C$12=\"C\"),selection!Y30,IF(AND(C$13=1100,C$12=\"D\"),selection!Z30,IF(AND(C$13=1200,C$12=\"A\"),selection!AB30,IF(AND(C$13=1200,C$12=\"B\"),selection!AC30,IF(AND(C$13=1200,C$12=\"C\"),selection!AD30,IF(AND(C$13=1200,C$12=\"D\"),selection!AE30,IF(AND(C$13=1500,C$12=\"A\"),selection!AG30,IF(AND(C$13=1500,C$12=\"B\"),selection!AH30,IF(AND(C$13=1500,C$12=\"C\"),selection!AI30,IF(AND(C$13=1500,C$12=\"D\"),selection!AJ30,IF(AND(C$13=1800,C$12=\"A\"),selection!AL30,IF(AND(C$13=1800,C$12=\"B\"),selection!AM30,IF(AND(C$13=1800,C$12=\"C\"),selection!AN30,IF(AND(C$13=1800,C$12=\"D\"),selection!AO30,IF(AND(C$13=2100,C$12=\"A\"),selection!AQ30,IF(AND(C$13=2100,C$12=\"B\"),selection!AR30,IF(AND(C$13=2100,C$12=\"C\"),selection!AS30,IF(AND(C$13=2100,C$12=\"D\"),selection!AT30,IF(AND(C$13=2400,C$12=\"A\"),selection!AV30,IF(AND(C$13=2400,C$12=\"B\"),selection!AW30,IF(AND(C$13=2400,C$12=\"C\"),selection!AX30,IF(AND(C$13=2400,C$12=\"D\"),selection!AY30,IF(AND(C$13=2700,C$12=\"A\"),selection!BA30,IF(AND(C$13=2700,C$12=\"B\"),selection!BB30,IF(AND(C$13=2700,C$12=\"C\"),selection!BC30,IF(AND(C$13=2700,C$12=\"D\"),selection!BD30,IF(AND(C$13=2950,C$12=\"A\"),selection!BF30,IF(AND(C$13=2950,C$12=\"B\"),selection!BG30,IF(AND(C$13=2950,C$12=\"C\"),selection!BH30,IF(AND(C$13=2950,C$12=\"D\"),selection!BI30)))))))))))))))))))))))))))))))))))))))))))))","v":647.85143308246052},{"$f":"IF(selection!F13=\"\",\"0\",selection!F13)","v":"0"},{"$f":"E14","v":"Supply (primary) air temperature:"},null,{"$f":"selection!C14","v":20},"ºC"]
[{"$f":"A17","v":"Temperature difference battery:"},"ºC",{"$f":"IF(AND(L12=\"yes\",M12=0),0,IF(AND(C$13=600,C$12=\"A\"),selection!H45,IF(AND(C$13=600,C$12=\"B\"),selection!I45,IF(AND(C$13=600,C$12=\"C\"),selection!J45,IF(AND(C$13=600,C$12=\"D\"),selection!K45,IF(AND(C$13=900,C$12=\"A\"),selection!M45,IF(AND(C$13=900,C$12=\"B\"),selection!N45,IF(AND(C$13=900,C$12=\"C\"),selection!O45,IF(AND(C$13=900,C$12=\"D\"),selection!P45,IF(AND(C$13=1000,C$12=\"A\"),selection!R45,IF(AND(C$13=1000,C$12=\"B\"),selection!S45,IF(AND(C$13=1000,C$12=\"C\"),selection!T45,IF(AND(C$13=1000,C$12=\"D\"),selection!U45,IF(AND(C$13=1100,C$12=\"A\"),selection!W45,IF(AND(C$13=1100,C$12=\"B\"),selection!X45,IF(AND(C$13=1100,C$12=\"C\"),selection!Y45,IF(AND(C$13=1100,C$12=\"D\"),selection!Z45,IF(AND(C$13=1200,C$12=\"A\"),selection!AB45,IF(AND(C$13=1200,C$12=\"B\"),selection!AC45,IF(AND(C$13=1200,C$12=\"C\"),selection!AD45,IF(AND(C$13=1200,C$12=\"D\"),selection!AE45,IF(AND(C$13=1500,C$12=\"A\"),selection!AG45,IF(AND(C$13=1500,C$12=\"B\"),selection!AH45,IF(AND(C$13=1500,C$12=\"C\"),selection!AI45,IF(AND(C$13=1500,C$12=\"D\"),selection!AJ45,IF(AND(C$13=1800,C$12=\"A\"),selection!AL45,IF(AND(C$13=1800,C$12=\"B\"),selection!AM45,IF(AND(C$13=1800,C$12=\"C\"),selection!AN45,IF(AND(C$13=1800,C$12=\"D\"),selection!AO45,IF(AND(C$13=2100,C$12=\"A\"),selection!AQ45,IF(AND(C$13=2100,C$12=\"B\"),selection!AR45,IF(AND(C$13=2100,C$12=\"C\"),selection!AS45,IF(AND(C$13=2100,C$12=\"D\"),selection!AT45,IF(AND(C$13=2400,C$12=\"A\"),selection!AV45,IF(AND(C$13=2400,C$12=\"B\"),selection!AW45,IF(AND(C$13=2400,C$12=\"C\"),selection!AX45,IF(AND(C$13=2400,C$12=\"D\"),selection!AY45,IF(AND(C$13=2700,C$12=\"A\"),selection!BA45,IF(AND(C$13=2700,C$12=\"B\"),selection!BB45,IF(AND(C$13=2700,C$12=\"C\"),selection!BC45,IF(AND(C$13=2700,C$12=\"D\"),selection!BD45,IF(AND(C$13=2950,C$12=\"A\"),selection!BF45,IF(AND(C$13=2950,C$12=\"B\"),selection!BG45,IF(AND(C$13=2950,C$12=\"C\"),selection!BH45,IF(AND(C$13=2950,C$12=\"D\"),selection!BI45)))))))))))))))))))))))))))))))))))))))))))))","v":5.6346889785375085},{"$f":"IF(selection!F12=\"\",\"0\",selection!F12)","v":"0"},{"$f":"E15","v":"Water inlet temperature:"},null,{"$f":"selection!C15","v":45},"ºC"]
[{"$f":"A18","v":"Water capacity:"},"W",{"$f":"IF(AND(L12=\"yes\",M12=0),0,IF(AND(C$13=600,C$12=\"A\"),selection!H34,IF(AND(C$13=600,C$12=\"B\"),selection!I34,IF(AND(C$13=600,C$12=\"C\"),selection!J34,IF(AND(C$13=600,C$12=\"D\"),selection!K34,IF(AND(C$13=900,C$12=\"A\"),selection!M34,IF(AND(C$13=900,C$12=\"B\"),selection!N34,IF(AND(C$13=900,C$12=\"C\"),selection!O34,IF(AND(C$13=900,C$12=\"D\"),selection!P34,IF(AND(C$13=1000,C$12=\"A\"),selection!R34,IF(AND(C$13=1000,C$12=\"B\"),selection!S34,IF(AND(C$13=1000,C$12=\"C\"),selection!T34,IF(AND(C$13=1000,C$12=\"D\"),selection!U34,IF(AND(C$13=1100,C$12=\"A\"),selection!W34,IF(AND(C$13=1100,C$12=\"B\"),selection!X34,IF(AND(C$13=1100,C$12=\"C\"),selection!Y34,IF(AND(C$13=1100,C$12=\"D\"),selection!Z34,IF(AND(C$13=1200,C$12=\"A\"),selection!AB34,IF(AND(C$13=1200,C$12=\"B\"),selection!AC34,IF(AND(C$13=1200,C$12=\"C\"),selection!AD34,IF(AND(C$13=1200,C$12=\"D\"),selection!AE34,IF(AND(C$13=1500,C$12=\"A\"),selection!AG34,IF(AND(C$13=1500,C$12=\"B\"),selection!AH34,IF(AND(C$13=1500,C$12=\"C\"),selection!AI34,IF(AND(C$13=1500,C$12=\"D\"),selection!AJ34,IF(AND(C$13=1800,C$12=\"A\"),selection!AL34,IF(AND(C$13=1800,C$12=\"B\"),selection!AM34,IF(AND(C$13=1800,C$12=\"C\"),selection!AN34,IF(AND(C$13=1800,C$12=\"D\"),selection!AO34,IF(AND(C$13=2100,C$12=\"A\"),selection!AQ34,IF(AND(C$13=2100,C$12=\"B\"),selection!AR34,IF(AND(C$13=2100,C$12=\"C\"),selection!AS34,IF(AND(C$13=2100,C$12=\"D\"),selection!AT34,IF(AND(C$13=2400,C$12=\"A\"),selection!AV34,IF(AND(C$13=2400,C$12=\"B\"),selection!AW34,IF(AND(C$13=2400,C$12=\"C\"),selection!AX34,IF(AND(C$13=2400,C$12=\"D\"),selection!AY34,IF(AND(C$13=2700,C$12=\"A\"),selection!BA34,IF(AND(C$13=2700,C$12=\"B\"),selection!BB34,IF(AND(C$13=2700,C$12=\"C\"),selection!BC34,IF(AND(C$13=2700,C$12=\"D\"),selection!BD34,IF(AND(C$13=2950,C$12=\"A\"),selection!BF34,IF(AND(C$13=2950,C$12=\"B\"),selection!BG34,IF(AND(C$13=2950,C$12=\"C\"),selection!BH34,IF(AND(C$13=2950,C$12=\"D\"),selection!BI34)))))))))))))))))))))))))))))))))))))))))))))","v":647.85143308246052},null,{"$f":"E16","v":"Water flow rate :"},null,{"$f":"IF(AND(L12=\"yes\",M12=0),0,selection!C16)","v":100},"l/h"]
[{"$f":"A19","v":"Supply (primary) air capacity:"},"W",{"$f":"IF(AND(L12=\"yes\",M12=0),0,IF(AND(C$13=600,C$12=\"A\"),selection!H35,IF(AND(C$13=600,C$12=\"B\"),selection!I35,IF(AND(C$13=600,C$12=\"C\"),selection!J35,IF(AND(C$13=600,C$12=\"D\"),selection!K35,IF(AND(C$13=900,C$12=\"A\"),selection!M35,IF(AND(C$13=900,C$12=\"B\"),selection!N35,IF(AND(C$13=900,C$12=\"C\"),selection!O35,IF(AND(C$13=900,C$12=\"D\"),selection!P35,IF(AND(C$13=1000,C$12=\"A\"),selection!R35,IF(AND(C$13=1000,C$12=\"B\"),selection!S35,IF(AND(C$13=1000,C$12=\"C\"),selection!T35,IF(AND(C$13=1000,C$12=\"D\"),selection!U35,IF(AND(C$13=1100,C$12=\"A\"),selection!W35,IF(AND(C$13=1100,C$12=\"B\"),selection!X35,IF(AND(C$13=1100,C$12=\"C\"),selection!Y35,IF(AND(C$13=1100,C$12=\"D\"),selection!Z35,IF(AND(C$13=1200,C$12=\"A\"),selection!AB35,IF(AND(C$13=1200,C$12=\"B\"),selection!AC35,IF(AND(C$13=1200,C$12=\"C\"),selection!AD35,IF(AND(C$13=1200,C$12=\"D\"),selection!AE35,IF(AND(C$13=1500,C$12=\"A\"),selection!AG35,IF(AND(C$13=1500,C$12=\"B\"),selection!AH35,IF(AND(C$13=1500,C$12=\"C\"),selection!AI35,IF(AND(C$13=1500,C$12=\"D\"),selection!AJ35,IF(AND(C$13=1800,C$12=\"A\"),selection!AL35,IF(AND(C$13=1800,C$12=\"B\"),selection!AM35,IF(AND(C$13=1800,C$12=\"C\"),selection!AN35,IF(AND(C$13=1800,C$12=\"D\"),selection!AO35,IF(AND(C$13=2100,C$12=\"A\"),selection!AQ35,IF(AND(C$13=2100,C$12=\"B\"),selection!AR35,IF(AND(C$13=2100,C$12=\"C\"),selection!AS35,IF(AND(C$13=2100,C$12=\"D\"),selection!AT35,IF(AND(C$13=2400,C$12=\"A\"),selection!AV35,IF(AND(C$13=2400,C$12=\"B\"),selection!AW35,IF(AND(C$13=2400,C$12=\"C\"),selection!AX35,IF(AND(C$13=2400,C$12=\"D\"),selection!AY35,IF(AND(C$13=2700,C$12=\"A\"),selection!BA35,IF(AND(C$13=2700,C$12=\"B\"),selection!BB35,IF(AND(C$13=2700,C$12=\"C\"),selection!BC35,IF(AND(C$13=2700,C$12=\"D\"),selection!BD35,IF(AND(C$13=2950,C$12=\"A\"),selection!BF35,IF(AND(C$13=2950,C$12=\"B\"),selection!BG35,IF(AND(C$13=2950,C$12=\"C\"),selection!BH35,IF(AND(C$13=2950,C$12=\"D\"),selection!BI35)))))))))))))))))))))))))))))))))))))))))))))","v":0}]
[{"$f":"A20","v":"Water pressure drop:"},"kPa",{"$f":"IF(AND(L12=\"yes\",M12=0),0,IF(AND(C$13=600,C$12=\"A\"),selection!H33,IF(AND(C$13=600,C$12=\"B\"),selection!I33,IF(AND(C$13=600,C$12=\"C\"),selection!J33,IF(AND(C$13=600,C$12=\"D\"),selection!K33,IF(AND(C$13=900,C$12=\"A\"),selection!M33,IF(AND(C$13=900,C$12=\"B\"),selection!N33,IF(AND(C$13=900,C$12=\"C\"),selection!O33,IF(AND(C$13=900,C$12=\"D\"),selection!P33,IF(AND(C$13=1000,C$12=\"A\"),selection!R33,IF(AND(C$13=1000,C$12=\"B\"),selection!S33,IF(AND(C$13=1000,C$12=\"C\"),selection!T33,IF(AND(C$13=1000,C$12=\"D\"),selection!U33,IF(AND(C$13=1100,C$12=\"A\"),selection!W33,IF(AND(C$13=1100,C$12=\"B\"),selection!X33,IF(AND(C$13=1100,C$12=\"C\"),selection!Y33,IF(AND(C$13=1100,C$12=\"D\"),selection!Z33,IF(AND(C$13=1200,C$12=\"A\"),selection!AB33,IF(AND(C$13=1200,C$12=\"B\"),selection!AC33,IF(AND(C$13=1200,C$12=\"C\"),selection!AD33,IF(AND(C$13=1200,C$12=\"D\"),selection!AE33,IF(AND(C$13=1500,C$12=\"A\"),selection!AG33,IF(AND(C$13=1500,C$12=\"B\"),selection!AH33,IF(AND(C$13=1500,C$12=\"C\"),selection!AI33,IF(AND(C$13=1500,C$12=\"D\"),selection!AJ33,IF(AND(C$13=1800,C$12=\"A\"),selection!AL33,IF(AND(C$13=1800,C$12=\"B\"),selection!AM33,IF(AND(C$13=1800,C$12=\"C\"),selection!AN33,IF(AND(C$13=1800,C$12=\"D\"),selection!AO33,IF(AND(C$13=2100,C$12=\"A\"),selection!AQ33,IF(AND(C$13=2100,C$12=\"B\"),selection!AR33,IF(AND(C$13=2100,C$12=\"C\"),selection!AS33,IF(AND(C$13=2100,C$12=\"D\"),selection!AT33,IF(AND(C$13=2400,C$12=\"A\"),selection!AV33,IF(AND(C$13=2400,C$12=\"B\"),selection!AW33,IF(AND(C$13=2400,C$12=\"C\"),selection!AX33,IF(AND(C$13=2400,C$12=\"D\"),selection!AY33,IF(AND(C$13=2700,C$12=\"A\"),selection!BA33,IF(AND(C$13=2700,C$12=\"B\"),selection!BB33,IF(AND(C$13=2700,C$12=\"C\"),selection!BC33,IF(AND(C$13=2700,C$12=\"D\"),selection!BD33,IF(AND(C$13=2950,C$12=\"A\"),selection!BF33,IF(AND(C$13=2950,C$12=\"B\"),selection!BG33,IF(AND(C$13=2950,C$12=\"C\"),selection!BH33,IF(AND(C$13=2950,C$12=\"D\"),selection!BI33)))))))))))))))))))))))))))))))))))))))))))))","v":0.52530979699911717}]
[{"$f":"A15","v":"Plenum static pressure:"},"Pa",{"$f":"IF(AND(C$13=600,C$12=\"A\"),selection!H31,IF(AND(C$13=600,C$12=\"B\"),selection!I31,IF(AND(C$13=600,C$12=\"C\"),selection!J31,IF(AND(C$13=600,C$12=\"D\"),selection!K31,IF(AND(C$13=900,C$12=\"A\"),selection!M31,IF(AND(C$13=900,C$12=\"B\"),selection!N31,IF(AND(C$13=900,C$12=\"C\"),selection!O31,IF(AND(C$13=900,C$12=\"D\"),selection!P31,IF(AND(C$13=1000,C$12=\"A\"),selection!R31,IF(AND(C$13=1000,C$12=\"B\"),selection!S31,IF(AND(C$13=1000,C$12=\"C\"),selection!T31,IF(AND(C$13=1000,C$12=\"D\"),selection!U31,IF(AND(C$13=1100,C$12=\"A\"),selection!W31,IF(AND(C$13=1100,C$12=\"B\"),selection!X31,IF(AND(C$13=1100,C$12=\"C\"),selection!Y31,IF(AND(C$13=1100,C$12=\"D\"),selection!Z31,IF(AND(C$13=1200,C$12=\"A\"),selection!AB31,IF(AND(C$13=1200,C$12=\"B\"),selection!AC31,IF(AND(C$13=1200,C$12=\"C\"),selection!AD31,IF(AND(C$13=1200,C$12=\"D\"),selection!AE31,IF(AND(C$13=1500,C$12=\"A\"),selection!AG31,IF(AND(C$13=1500,C$12=\"B\"),selection!AH31,IF(AND(C$13=1500,C$12=\"C\"),selection!AI31,IF(AND(C$13=1500,C$12=\"D\"),selection!AJ31,IF(AND(C$13=1800,C$12=\"A\"),selection!AL31,IF(AND(C$13=1800,C$12=\"B\"),selection!AM31,IF(AND(C$13=1800,C$12=\"C\"),selection!AN31,IF(AND(C$13=1800,C$12=\"D\"),selection!AO31,IF(AND(C$13=2100,C$12=\"A\"),selection!AQ31,IF(AND(C$13=2100,C$12=\"B\"),selection!AR31,IF(AND(C$13=2100,C$12=\"C\"),selection!AS31,IF(AND(C$13=2100,C$12=\"D\"),selection!AT31,IF(AND(C$13=2400,C$12=\"A\"),selection!AV31,IF(AND(C$13=2400,C$12=\"B\"),selection!AW31,IF(AND(C$13=2400,C$12=\"C\"),selection!AX31,IF(AND(C$13=2400,C$12=\"D\"),selection!AY31,IF(AND(C$13=2700,C$12=\"A\"),selection!BA31,IF(AND(C$13=2700,C$12=\"B\"),selection!BB31,IF(AND(C$13=2700,C$12=\"C\"),selection!BC31,IF(AND(C$13=2700,C$12=\"D\"),selection!BD31,IF(AND(C$13=2950,C$12=\"A\"),selection!BF31,IF(AND(C$13=2950,C$12=\"B\"),selection!BG31,IF(AND(C$13=2950,C$12=\"C\"),selection!BH31,IF(AND(C$13=2950,C$12=\"D\"),selection!BI31))))))))))))))))))))))))))))))))))))))))))))","v":49.238623975303348}]
[{"$f":"A21","v":"Sound level (excl. room attenuation):"},"dB(A)",{"$f":"IF(AND(C$13=600,C$12=\"A\"),selection!H32,IF(AND(C$13=600,C$12=\"B\"),selection!I32,IF(AND(C$13=600,C$12=\"C\"),selection!J32,IF(AND(C$13=600,C$12=\"D\"),selection!K32,IF(AND(C$13=900,C$12=\"A\"),selection!M32,IF(AND(C$13=900,C$12=\"B\"),selection!N32,IF(AND(C$13=900,C$12=\"C\"),selection!O32,IF(AND(C$13=900,C$12=\"D\"),selection!P32,IF(AND(C$13=1000,C$12=\"A\"),selection!R32,IF(AND(C$13=1000,C$12=\"B\"),selection!S32,IF(AND(C$13=1000,C$12=\"C\"),selection!T32,IF(AND(C$13=1000,C$12=\"D\"),selection!U32,IF(AND(C$13=1100,C$12=\"A\"),selection!W32,IF(AND(C$13=1100,C$12=\"B\"),selection!X32,IF(AND(C$13=1100,C$12=\"C\"),selection!Y32,IF(AND(C$13=1100,C$12=\"D\"),selection!Z32,IF(AND(C$13=1200,C$12=\"A\"),selection!AB32,IF(AND(C$13=1200,C$12=\"B\"),selection!AC32,IF(AND(C$13=1200,C$12=\"C\"),selection!AD32,IF(AND(C$13=1200,C$12=\"D\"),selection!AE32,IF(AND(C$13=1500,C$12=\"A\"),selection!AG32,IF(AND(C$13=1500,C$12=\"B\"),selection!AH32,IF(AND(C$13=1500,C$12=\"C\"),selection!AI32,IF(AND(C$13=1500,C$12=\"D\"),selection!AJ32,IF(AND(C$13=1800,C$12=\"A\"),selection!AL32,IF(AND(C$13=1800,C$12=\"B\"),selection!AM32,IF(AND(C$13=1800,C$12=\"C\"),selection!AN32,IF(AND(C$13=1800,C$12=\"D\"),selection!AO32,IF(AND(C$13=2100,C$12=\"A\"),selection!AQ32,IF(AND(C$13=2100,C$12=\"B\"),selection!AR32,IF(AND(C$13=2100,C$12=\"C\"),selection!AS32,IF(AND(C$13=2100,C$12=\"D\"),selection!AT32,IF(AND(C$13=2400,C$12=\"A\"),selection!AV32,IF(AND(C$13=2400,C$12=\"B\"),selection!AW32,IF(AND(C$13=2400,C$12=\"C\"),selection!AX32,IF(AND(C$13=2400,C$12=\"D\"),selection!AY32,IF(AND(C$13=2700,C$12=\"A\"),selection!BA32,IF(AND(C$13=2700,C$12=\"B\"),selection!BB32,IF(AND(C$13=2700,C$12=\"C\"),selection!BC32,IF(AND(C$13=2700,C$12=\"D\"),selection!BD32,IF(AND(C$13=2950,C$12=\"A\"),selection!BF32,IF(AND(C$13=2950,C$12=\"B\"),selection!BG32,IF(AND(C$13=2950,C$12=\"C\"),selection!BH32,IF(AND(C$13=2950,C$12=\"D\"),selection!BI32))))))))))))))))))))))))))))))))))))))))))))","v":25.973219914659854}]
[{"$f":"IF('general info'!$F$1=\"NL\",talen!A27,IF('general info'!$F$1=\"FR\",talen!B27,IF('general info'!$F$1=\"EN\",talen!C27,talen!D27)))","v":"Mean temperature difference air-water:"},"Dq",{"$f":"IF(AND(C$13=600,C$12=\"A\"),selection!H46,IF(AND(C$13=600,C$12=\"B\"),selection!I46,IF(AND(C$13=600,C$12=\"C\"),selection!J46,IF(AND(C$13=600,C$12=\"D\"),selection!K46,IF(AND(C$13=900,C$12=\"A\"),selection!M46,IF(AND(C$13=900,C$12=\"B\"),selection!N46,IF(AND(C$13=900,C$12=\"C\"),selection!O46,IF(AND(C$13=900,C$12=\"D\"),selection!P46,IF(AND(C$13=1000,C$12=\"A\"),selection!R46,IF(AND(C$13=1000,C$12=\"B\"),selection!S46,IF(AND(C$13=1000,C$12=\"C\"),selection!T46,IF(AND(C$13=1000,C$12=\"D\"),selection!U46,IF(AND(C$13=1100,C$12=\"A\"),selection!W46,IF(AND(C$13=1100,C$12=\"B\"),selection!X46,IF(AND(C$13=1100,C$12=\"C\"),selection!Y46,IF(AND(C$13=1100,C$12=\"D\"),selection!Z46,IF(AND(C$13=1200,C$12=\"A\"),selection!AB46,IF(AND(C$13=1200,C$12=\"B\"),selection!AC46,IF(AND(C$13=1200,C$12=\"C\"),selection!AD46,IF(AND(C$13=1200,C$12=\"D\"),selection!AE46,IF(AND(C$13=1500,C$12=\"A\"),selection!AG46,IF(AND(C$13=1500,C$12=\"B\"),selection!AH46,IF(AND(C$13=1500,C$12=\"C\"),selection!AI46,IF(AND(C$13=1500,C$12=\"D\"),selection!AJ46,IF(AND(C$13=1800,C$12=\"A\"),selection!AL46,IF(AND(C$13=1800,C$12=\"B\"),selection!AM46,IF(AND(C$13=1800,C$12=\"C\"),selection!AN46,IF(AND(C$13=1800,C$12=\"D\"),selection!AO46,IF(AND(C$13=2100,C$12=\"A\"),selection!AQ46,IF(AND(C$13=2100,C$12=\"B\"),selection!AR46,IF(AND(C$13=2100,C$12=\"C\"),selection!AS46,IF(AND(C$13=2100,C$12=\"D\"),selection!AT46,IF(AND(C$13=2400,C$12=\"A\"),selection!AV46,IF(AND(C$13=2400,C$12=\"B\"),selection!AW46,IF(AND(C$13=2400,C$12=\"C\"),selection!AX46,IF(AND(C$13=2400,C$12=\"D\"),selection!AY46,IF(AND(C$13=2700,C$12=\"A\"),selection!BA46,IF(AND(C$13=2700,C$12=\"B\"),selection!BB46,IF(AND(C$13=2700,C$12=\"C\"),selection!BC46,IF(AND(C$13=2700,C$12=\"D\"),selection!BD46,IF(AND(C$13=2950,C$12=\"A\"),selection!BF46,IF(AND(C$13=2950,C$12=\"B\"),selection!BG46,IF(AND(C$13=2950,C$12=\"C\"),selection!BH46,IF(AND(C$13=2950,C$12=\"D\"),selection!BI46))))))))))))))))))))))))))))))))))))))))))))","v":22.182655510731244}]

{"sheet":"summary","index":4,"n_rows":35,"n_cols":26,"rows_kept":35,"cut":false,"hidden":false,"merged":[[22,0,26,25],[27,24,27,25],[28,0,28,1],[28,2,28,8],[28,9,28,11],[28,12,28,19],[28,20,28,21],[28,22,28,24],[31,0,34,0],[31,7,34,7],[31,8,32,8],[31,1,32,3],[31,4,32,6],[29,2,29,8],[29,9,29,11],[29,12,29,25],[30,0,30,1],[30,2,30,25],[33,22,33,23],[33,24,33,25],[31,9,31,13],[31,14,31,21],[31,22,31,23],[31,24,31,25],[32,14,32,17],[32,18,32,21]]}
[]
[]
[]
[]
[]
[]
[]
[]
[]
[]
[]
[]
[]
[]
[]
[]
[]
[]
[]
[]
[]
[]
[]
[]
[]
[]
[]
[]
[{"$f":"IF('general info'!F1=\"NL\",talen!A81,IF('general info'!F1=\"FR\",talen!B81,IF('general info'!F1=\"EN\",talen!C81,talen!D81)))","v":"user"},null,null,null,null,null,null,null,null,{"$f":"IF('general info'!$F$1=\"NL\",talen!$A86,IF('general info'!$F$1=\"FR\",talen!$B86,IF('general info'!$F$1=\"EN\",talen!$C86,talen!$D86)))","v":"customer ID"},null,null,null,null,null,null,null,null,null,null,{"$f":"IF('general info'!F1=\"NL\",talen!A85,IF('general info'!F1=\"FR\",talen!B85,IF('general info'!F1=\"EN\",talen!C85,talen!D85)))","v":"date"},null,{"$f":"TODAY()","v":"2021-09-15"}]
[{"$f":"IF('general info'!F1=\"NL\",talen!A2,IF('general info'!F1=\"FR\",talen!B2,IF('general info'!F1=\"EN\",talen!C2,talen!D2)))","v":"Project/Building:"},null,{"$f":"IF(selection!B2=\"\",\"\",selection!B2)","v":""}]
[{"$f":"IF('general info'!F1=\"NL\",talen!A82,IF('general info'!F1=\"FR\",talen!B82,IF('general info'!F1=\"EN\",talen!C82,talen!D82)))","v":"remarks"}]
[{"$f":"IF('general info'!F1=\"NL\",talen!A3,IF('general info'!F1=\"FR\",talen!B3,IF('general info'!F1=\"EN\",talen!C3,talen!D3)))","v":"Reference/ Room data:"},{"$f":"IF('general info'!F1=\"NL\",talen!A53,IF('general info'!F1=\"FR\",talen!B53,IF('general info'!F1=\"EN\",talen!C53,talen!D53)))","v":"Cooling"},null,null,{"$f":"IF('general info'!F1=\"NL\",talen!A54,IF('general info'!F1=\"FR\",talen!B54,IF('general info'!F1=\"EN\",talen!C54,talen!D54)))","v":"Heating"},null,null,"n°",null,{"$f":"IF('general info'!F1=\"NL\",talen!A83,IF('general info'!F1=\"FR\",talen!B83,IF('general info'!F1=\"EN\",talen!C83,talen!D83)))","v":"air"},null,null,null,null,{"$f":"IF('general info'!F1=\"NL\",talen!A84,IF('general info'!F1=\"FR\",talen!B84,IF('general info'!F1=\"EN\",talen!C84,talen!D84)))","v":"water"},null,null,null,null,null,null,null,{"$f":"IF('general info'!F1=\"NL\",talen!A80,IF('general info'!F1=\"FR\",talen!B80,IF('general info'!F1=\"EN\",talen!C80,talen!D80)))","v":"actual"},null,{"$f":"IF('general info'!$F$1=\"NL\",talen!$A66,IF('general info'!$F$1=\"FR\",talen!$B66,IF('general info'!$F$1=\"EN\",talen!$C66,talen!$D66)))","v":"Required"}]
[null,null,null,null,null,null,null,null,null,null,null,null,{"$f":"IF('general info'!F1=\"NL\",talen!A78,IF('general info'!F1=\"FR\",talen!B78,IF('general info'!F1=\"EN\",talen!C78,talen!D78)))","v":"cool"},{"$f":"IF('general info'!F1=\"NL\",talen!A79,IF('general info'!F1=\"FR\",talen!B79,IF('general info'!F1=\"EN\",talen!C79,talen!D79)))","v":"heat"},{"$f":"IF('general info'!F1=\"NL\",talen!A53,IF('general info'!F1=\"FR\",talen!B53,IF('general info'!F1=\"EN\",talen!C53,talen!D53)))","v":"Cooling"},null,null,null,{"$f":"IF('general info'!F1=\"NL\",talen!A54,IF('general info'!F1=\"FR\",talen!B54,IF('general info'!F1=\"EN\",talen!C54,talen!D54)))","v":"Heating"},null,null,null,{"$f":"IF('general info'!F1=\"NL\",talen!A78,IF('general info'!F1=\"FR\",talen!B78,IF('general info'!F1=\"EN\",talen!C78,talen!D78)))","v":"cool"},{"$f":"IF('general info'!F1=\"NL\",talen!A79,IF('general info'!F1=\"FR\",talen!B79,IF('general info'!F1=\"EN\",talen!C79,talen!D79)))","v":"heat"},{"$f":"IF('general info'!F1=\"NL\",talen!A78,IF('general info'!F1=\"FR\",talen!B78,IF('general info'!F1=\"EN\",talen!C78,talen!D78)))","v":"cool"},{"$f":"IF('general info'!F1=\"NL\",talen!A79,IF('general info'!F1=\"FR\",talen!B79,IF('general info'!F1=\"EN\",talen!C79,talen!D79)))","v":"heat"}]
[null,"Tr","Tp","Twin","Tr","Tp","Twin",null,"CODE","Qv","Ps","Lw","Pa","Pa","Qw","Pb","Pw","∆T","Qw","Pb","Pw","∆T","Pt",null,"Pt"]
[null,"°C","°C","°C","°C","°C","°C",null,null,"m³/h","Pa","dB(A)","W","W","l/h","kPa","W","°C","l/h","kPa","W","°C","W","W","W","W"]

{"sheet":"air velocities","index":5,"n_rows":35,"n_cols":23,"rows_kept":35,"cut":false,"hidden":false,"merged":[[29,11,29,16],[0,0,4,25],[6,0,6,1],[6,2,6,8],[6,9,6,11],[6,12,6,19],[6,20,6,21],[6,22,6,24],[7,2,7,8],[7,9,7,11],[7,12,7,25],[8,0,8,1],[8,2,8,25],[30,11,30,16],[31,11,31,16],[32,11,32,16],[33,11,33,16],[34,11,34,16]]}
[]
[]
[]
[]
[]
[]
[{"$f":"IF('general info'!F1=\"NL\",talen!A81,IF('general info'!F1=\"FR\",talen!B81,IF('general info'!F1=\"EN\",talen!C81,talen!D81)))","v":"user"},null,{"$f":"summary!C29","v":0},null,null,null,null,null,null,{"$f":"IF('general info'!$F$1=\"NL\",talen!$A86,IF('general info'!$F$1=\"FR\",talen!$B86,IF('general info'!$F$1=\"EN\",talen!$C86,talen!$D86)))","v":"customer ID"},null,null,null,null,null,null,null,null,null,null,{"$f":"IF('general info'!F1=\"NL\",talen!A85,IF('general info'!F1=\"FR\",talen!B85,IF('general info'!F1=\"EN\",talen!C85,talen!D85)))","v":"date"},null,{"$f":"TODAY()","v":"2021-09-15"}]
[{"$f":"IF('general info'!F1=\"NL\",talen!A2,IF('general info'!F1=\"FR\",talen!B2,IF('general info'!F1=\"EN\",talen!C2,talen!D2)))","v":"Project/Building:"},null,{"$f":"summary!C30","v":""}]
[{"$f":"IF('general info'!F1=\"NL\",talen!A82,IF('general info'!F1=\"FR\",talen!B82,IF('general info'!F1=\"EN\",talen!C82,talen!D82)))","v":"remarks"}]
[]
[]
[]
[]
[]
[]
[]
[]
[]
[]
[]
[]
[]
[]
[]
[]
[]
[]
[]
[]
[]
[]
[]
[]
[]
["Room No.","H","X","Y","H1","L1","V1","L2","V2","L3","V3","Order Code"]

{"sheet":"instelwaarden & data","index":6,"n_rows":57,"n_cols":23,"rows_kept":57,"cut":false,"hidden":true,"merged":[[42,0,42,1],[35,0,35,3],[36,0,36,3],[37,0,37,3],[34,0,34,5]]}
["Type:","Length","aansluiting","Mounting \nType:","Perforation \nType","Installation","NozzleType:","UserID","type battery","extra's",null,null,null,null,null,null,null,null,null,null,"Français","English","Deutch"]
["None","None","None","None","None","None","None","None","C: Cooling only","- : None",null,null,null,null,null,null,null,"Tr","ºC","Ruimte temperatuur:","Température d'ambiance:","Room Air Temperature (Tr):","Raum-Temperatur:"]
["K60",600,"L: left connection","T: T-bar","2: Circular",null,"A","Arn Winand (arn.winand@grada.be)","H: cooling & heating coil","V: deflectoren",null,null,null,null,null,null,null,"Qp","m3/h","Toevoer (primair) lucht volume :","Débit d'air primaire:","Supply (Primary) Air Flow Rate:","Primärluft-Volumenstrom:"]
[null,900,"R: Right connection","S: Recessed","3: Square",null,"B","Gilbert Dumortier (gilbert.dumortier@grada.be)","E: cooling with electrical heating",null,null,null,null,null,null,null,null,"Tp","ºC","Toevoer (primair) lucht temp.:","Température d'air primaire:","Supply (Primary) Air Temperature (Tp):","Primärluft-Temperatur:"]
[null,1000,"G: left connection with 2 connections ( recommended @ Qp=130m³/h)","Z: Surface",null,null,"C","Koen Van Riet (koen.van.riet@grada.be)",null,null,null,null,null,null,null,null,null,"Twin","ºC","Inlaat water temperatuur:","Température d'eau d'entrée:","Water Inlet Temperature  (Twin):","Kaltwasser-Vorlauftemperatur:"]
[null,1100,"D: Right connection with 2 connections (recommended @ Qp=130m³/h)","V: Flush",null,null,"D","Steven Gobert (steven.gobert@grada.be)",null,null,null,null,null,null,null,null,null,"Qw","l/h","Water volume:","Débit d'eau:","Water Flow Rate :","Kaltwasser-Volumenstrom:"]
[null,1200,null,null,null,null,null,"Tilly Van Cauwenberghe (tilly.vancauwenberghe@grada.be)",null,null,null,null,null,null,null,null,null,"type batt","C/CH","Type batterij (koeling/koeling & verwarming ):","type de batterie (seul refroidissement / refroidissemen et chaleur ):","Type of battery (cooling/cooling & heating):","Batterietyp (Kühlung/Kühlung und Heizung):"]
[null,1500,null,null,null,null,null,"Brahim Essabir (brahim.essabir@gradafrance.com)",null,null,null,null,null,null,null,null,null,"x","m","Afstand tot de muur:","Distance jusque au cloison:","Distance to wall:","Abstand zu dem Mauer:"]
[null,1800,null,null,null,null,null,"Stephane Chaleroux (stephane.chaleroux@gradafrance.com)",null,null,null,null,null,null,null,null,null,"y","m","Afstand tussen 2 koelbalken:","Distance entre 2 poutre:","Distance between chilled beams :","Abstand zwischen zwei Kühlbalken:"]
[null,2100,null,null,null,null,null,"Erik Sauvage (erik.sauvage@gradafrance.com)",null,null,null,null,null,null,null,null,null,"Pt","W","Totale vermogen:","Puissance totale:","Total Capacity:","Gesamt-Kühlleistung:"]
[null,2400,null,null,null,null,null,"Ismail Hajji (ismail.hajji@gradafrance.com)",null,null,null,null,null,null,null,null,null,"Ps","Pa","Plenum statische druk:","Pression statique dans le plénum:","Plenum static pressure:","Primärluft-Druckverlust:"]
[null,2700,null,null,null,null,null,"Lahcene Slimi (Lahcene.slimi@gradafrance.com)",null,null,null,null,null,null,null,null,null,"LwA","dB(A)","Geluid Vermogen Pw:","Puissance acoustique Pw (sans atténuation du local):","Sound Power Pw:","NR Schallleistungspegel (ohne Raumdämpfung):"]
[null,2950,null,null,null,null,null,"György Pócsi (pocsi.gyorgy@grada.be)",null,null,null,null,null,null,null,null,null,"Pb","kPa","Water druk verlies:","Perte de pression de l'eau:","Water pressure drop:","Wasser-Druckverlust:"]
[null,null,null,null,null,null,null,"Ann Geerts (ann.geerts@grada.be )",null,null,null,null,null,null,null,null,null,"Pw","W","Waterzijdige vermogen:","Puissance de l'eau :","Water capacity:","Leistung Wasser:"]
[null,null,null,null,null,null,null,null,null,null,null,null,null,null,null,null,null,"Pa","W","Luchtzijdig vermogen:","Puissance d'air:","Air capacity:","Leistung Luft:"]
["gebruikt in VBA:",null,null,null,null,null,null,null,null,null,null,null,null,null,null,null,null,"V1","m/s","v1 (0,5m van de muur op 1,8m hoogtet):","Vitesse d'air V1:","v1 (0,5m from wall @ 1,8m height):","Luftgeschwindigkeit V1:"]
["Kolomnamen bij Wat Als-Analyse",null,null,null,null,null,null,null,null,null,null,null,null,null,null,null,null,"V2","m/s","v2 (0,5m van de muur op 0,1 m hoogte:","Vitesse d'air V2:","v2 (0,5m from wall @ 0,1 m height):","Luftgeschwindigkeit V2:"]
["Lnom","A","B","C","D","length0","Length1","length2","length3","length4","length5","length6","length7","length8","length9","length10",null,"V3","m/s","v3 (tussen 2 koelbalken op 1,8m hoogte):","Vitesse d'air V3:","v3 (between 2 chilled beams @ 1,8m height):","Luftgeschwindigkeit V3:"]
[600,"BP","BQ","BR","BS","None","None","None","None","None","None","None","None","None","None","None",null,"ΔT c","°C","Temperatuusverschil koelingbatterij:","Diff .Temp entre la batterie refroidissement:","ΔT battery cooling:","Temperaturdifferenz Batterie für Kühlung:"]
[900,"BJ","BK","BL","BM",600,600,600,600,600,600,600,600,600,600,600,null,"Δθ c","°C","Verschil temp. Lucht-Water: koeling:","Diff. Temp. D'air-de l'eau: refroidissement:","Temp. diff. air-water mean Dq: cooling:","Temperaturdifferenz Luft-Wasser Kühling:"]
[1000,"BD","BE","BF","BG",900,900,900,900,900,900,900,900,900,900,null,null,"ΔT h","°C","Temperatuursverschil warmwaterbatterij:","Diff .Temp entre la batterie chaleur:","ΔT battery heating:","Temperaturdifferenz Batterie für Heizung:"]
[1100,"AX","AY","AZ","BA",1000,1000,1000,1000,1000,1000,1000,1000,1000,null,null,null,"Δθ h","°C","Verschil temp. Lucht-Water: verwarming:","Diff. Temp. D'air-de l'eau: chaleur:","Temp. diff. air-water mean Dq: heating:","Temperaturdifferenz Luft-Wasser Heizung:"]
[1200,"AR","AS","AT","AU",1100,1100,1100,1100,1100,1100,1100,1100]
[1500,"AL","AM","AN","AO",1200,1200,1200,1200,1200,1200,1200]
[1800,"AF","AG","AH","AI",1500,1500,1500,1500,1500,1500]
[2100,"Z","AA","AB","AC",1800,1800,1800,1800,1800]
[2400,"T","U","V","W",2100,2100,2100,2100]
[2700,"N","O","P","Q",2400,2400,2400]
[2950,"H","I","J","K",2700,2700]
[null,null,null,null,null,2950]
[null,null,null,null,null,null,"Glength1","Glength2","Glength3","Glength4","Glength5","Glength6","Glength7","Glength8","Glength9","Glength10","Glength11",null,null,"nomlength"]
[null,null,null,null,null,null,2950,2950,2950,2950,2950,2950,2950,2950,2950,2950,2950,null,null,600]
[null,null,null,null,null,null,null,2700,2700,2700,2700,2700,2700,2700,2700,2700,2700,null,null,700]
[null,null,null,null,null,null,null,null,2400,2400,2400,2400,2400,2400,2400,2400,2400,null,null,800]
["instelwaarden visualisatie",null,null,null,null,null,null,null,null,2100,2100,2100,2100,2100,2100,2100,2100,null,null,900]
["max static pressure",null,null,null,180,"Pa",null,null,null,null,1800,1800,1800,1800,1800,1800,1800,null,null,1000]
["min static pressure",null,null,null,35,"Pa",null,null,null,null,null,1500,1500,1500,1500,1500,1500,null,null,1100]
["max differential pressure battery",null,null,null,35,"kPa",null,null,null,null,null,null,1200,1200,1200,1200,1200,null,null,1200]
[null,null,null,null,null,null,null,null,null,null,null,null,null,1100,1100,1100,1100,null,null,1300]
["instelwaarden",null,null,null,null,null,null,null,null,null,null,null,null,null,1000,1000,1000,null,null,1400]
[null,null,null,null,null,null,null,null,null,null,null,null,null,null,null,900,900,null,null,1500]
[null,null,null,null,null,null,null,null,null,null,null,null,null,null,null,null,600,null,null,1600]
["dauwpuntsT",null,{"$f":"(B46*B48)/(B45-B48)","v":13.842909696516159},null,null,null,null,null,null,null,null,null,null,null,null,null,null,null,null,1700]
[null,null,null,null,null,null,null,null,null,null,null,null,null,null,null,null,null,null,null,1800]
["a",17.271000000000001,null,null,null,null,null,null,null,null,null,null,null,null,null,null,null,null,null,1900]
["b",237.7,null,null,null,null,null,null,null,null,null,null,null,null,null,null,null,null,null,2000]
[null,null,null,null,null,null,null,null,null,null,null,null,null,null,null,null,null,null,null,2100]
["γ",{"$f":"(B45*selection!B12)/(B46+selection!B12)+LN(B49/100)","v":0.95045769191816676},null,null,null,null,null,null,null,null,null,null,null,null,null,null,null,null,null,2200]
["RH",50,null,null,null,null,null,null,null,null,null,null,null,null,null,null,null,null,null,2300]
[null,null,null,null,null,null,null,null,null,null,null,null,null,null,null,null,null,null,null,2400]
["gebruikt bij waterzijdige drukval",null,null,null,null,null,25.4,"mm",null,null,null,null,null,null,null,null,null,null,null,2500]
["Ø tubes",0.5,"inch",null,null,"1 inch",null,null,null,null,null,null,null,null,null,null,null,null,null,2600]
["Ø tubes",11.3,"[mm]",null,null,null,null,null,null,null,null,null,null,null,null,null,null,null,null,2700]
["A",{"$f":"((PI()*B53^2)/4)","v":100.28749148422018},"mm²",null,null,null,null,null,null,null,null,null,null,null,null,null,null,null,null,2800]
["A",{"$f":"B54*10^-6","v":1.0028749148422018E-4},"m²",null,null,null,null,null,null,null,null,null,null,null,null,null,null,null,null,2900]
[null,null,null,null,null,null,null,null,null,null,null,null,null,null,null,null,null,null,null,2950]
[null,null,null,null,null,null,null,null,null,null,null,null,null,null,null,null,null,null,null,3000]

{"sheet":"talen","index":7,"n_rows":86,"n_cols":4,"rows_kept":86,"cut":false,"hidden":true,"merged":[]}
["NL","FR","EN","DU"]
["Project/Gebouw:","Projet/ Construction:","Project/Building:","Projekt/ Gebäude:"]
["Referentie/ Kamer info:","Référence/ Info Chambre:","Reference/ Room data:","Referentz/ Raum info:"]
["# per Kamer:","# par chambre:","# per room:","# pro Zimmer:"]
["Kies het modeltype:","Sélectionnez le type de modèle:","Choose model type:","Wählen sie Ihr Modell Typ:"]
["Kies de modelspecificaties:","Sélectionnez les spécifications de modèle:","Choose model specifications:","Wählen sie Ihr Modell Spezifikationen:"]
["Figuur met modelspecificaties:","Figure de modèle:","Picture of model specifications:","Modell Spezificationen Abbildung:"]
["Kies de nominale lengte:","Sélectionnez la longueur nominale:","Choose nominal beam length:","Wählen Sie ihre Nennlänge:"]
["de batterijlengte:","la longueur de la batterie:","battery length:","Sie ihre Batterielänge:"]
["Ruimtetemperatuur:","Température ambiante:","Room air temperature:","Raum-Temperatur:"]
["Debiet  (primair) toevoerlucht:","Débit d'air primaire:","Supply (primary) air flow rate:","Primärluft-Volumenstrom:"]
["Temperatuur (primair) toevoerlucht:","Température d'air primaire:","Supply (primary) air temperature:","Primärluft-Temperatur:"]
["Temperatuur ingang water:","Température d'entrée de l'eau:","Water inlet temperature:","Kaltwasser-Vorlauftemperatur:"]
["Waterdebiet:","Débit d'eau:","Water flow rate :","Kaltwasser-Volumenstrom:"]
["Totaal verwacht vermogen:","Puissance totale attendue:","Required total capacity :","Gesamt erwartet Leistung:"]
["Temperatuursverschil batterij:","Différence de température de la batterie","Temperature difference battery:","Temperatur-Differenz-Batterie:"]
["Batterijlengte:","Longueur de la batterie:","Battery length:","Batterielänge:"]
["Nozzletype:","Type de buse:","Nozzle type:","Nozzletyp:"]
["Vermogen (primair) toevoerlucht:","Puissance d'air primaire:","Supply (primary) air capacity:","Kühlleistung der Primärluft:"]
["Waterzijdig vermogen:","Puissance d'eau secondaire:","Water capacity:","Kühlleistung der Sekundärluft:"]
["Totaal vermogen:","Puissance totale:","Total capacity:","Gesamtleistung:"]
["Temperatuur uitgang water:","Température de sortie de l'eau:","Water outlet temperature:","Kaltwasser-Rücklauftemperatur:"]
["Waterzijdig drukverlies:","Perte de pression de l'eau:","Water pressure drop:","Wasser-Druckverlust:"]
["Statische luchtdruk plenum:","Pression statique du plénum:","Plenum static pressure:","Primärluft-Druckverlust:"]
["Geluidsniveau (excl. ruimtedemping):","Niveau sonore (sans atténuation du local):","Sound level (excl. room attenuation):","Schallleistungspegel (ohne Raumdämpfung):"]
["Geluidsvermogen:","Puissance acoustique (sans atténuation du local):","Sound power:","Schallleistungspegel (ohne Raumdämpfung):"]
["Verschiltemperatuur lucht-water:","Différence de température entre l'air et l'eau:","Mean temperature difference air-water:","Temperaturdifferenz Luft-Wasser:"]
["Luchtsnelheid, V1:","Vitesse d'air, V1:","Room air velocity, V1:","Luftgeschwindigkeit, V1:"]
["Luchtsnelheid, V2:","Vitesse d'air, V2:","Room air velocity, V2:","Luftgeschwindigkeit, V2:"]
["Luchtsnelheid, V3:","Vitesse d'air, V3:","Room air velocity, V3:","Luftgeschwindigkeit, V3:"]
[]
["Batterijlengte:","Longueur de la batterie:","Battery lengtht:","Batterielänge:"]
["Nozzletype:","Type de buse:","Nozzle type:","Nozzletyp:"]
["Vermogen (primair) toevoerlucht:","Puissance d'air primaire:","Supply (primary) air capacity:","Kühlleistung der Primärluft:"]
["Waterzijdig vermogen:","Puissance d'eau secondaire:","Water capacity:","Kühlleistung der Sekundärluft:"]
["Totaal vermogen:","Puissance totale:","Total capacity:","Gesamt-Kühlleistung:"]
["Temperatuur uitgang water:","Température de sortie de l'eau:","Water outlet temperature:","Austrittstemperatur Wasser:"]
["Waterzijdig drukverlies:","Perte de pression de l'eau:","Water pressure drop:","Drulverlust Wasser:"]
["Statische luchtdruk plenum:","Pression statique du plénum:","Plenum static pressure:","Statischer Druck AnschlussKasten:"]
["Geluidsniveau (excl. ruimtedemping):","Niveau sonore (sans atténuation du local):","Sound level (excl. room attenuation):","Lärm (excl. Raumdämpfung):"]
["Geluidsvermogen, Pw:","Puissance acoustique (sans atténuation du local):","Sound power:","Shallleistung:"]
[]
["Gekozen nominale lengte:","Longueur nominale choisie:","Chosen nominal beam length:","gewählte Nennlänge Kuhlbalk:"]
["Kies nozzletype:","Sélectionnez le type de buse:","Choose nozzle type:","Wählen Sie ihre Nozzletyp:"]
["Bestelcode:","Code de commande:","Order code:","Bestellcode:"]
[]
["Hoogte ruimte [m]","Hauteur de la chambre [m]","Room height [m]","Höge Raum [m]"]
["Positie Koelbalk 1 [m]","Position poutre froide 1 [m]","Position chilled beam 1 [m]","Position Kuhlbalk 1 [m]"]
["Positie Koelbalk 2 [m]","Position poutre froide 2 [m]","Position chilled beam 2 [m]","Position Kuhlbalk 2 [m]"]
["Type montage","Type de montage","Mounting type","Befestigungart"]
["Perforatietype","Type de perforation","Perforation type","Typ Perforation"]
["Aansluiting","Raccordement","Connection","Anschluss"]
["Koeling","Refroidissement","Cooling","Kühlung"]
["Verwarming","Chauffage","Heating","Heizung"]
[]
["Eenheid","Unité","Unit","Einheit"]
["Betekenis","Signification","Meaning","Bedeutung"]
["Gebruikte afkorting","Abréviation utilisée","Used abbreviation","Benutzte Abkürzung"]
["Opties","Options","Options","Optionen"]
["Naam","Nom","Name","Name"]
["Model","Modèle","Model","Modell"]
["Batterijtype","Type de batterie","Battery type","Art der Batterie"]
["Lengte koelbalk","Longueur de la poutre froide","Beam length","Länge des Kuhlbalk"]
["Lengte batterij","Longueur de la batterie","Battery length","Länge der Batterie"]
["Invoergegevens","Donneés","Input data","Eingabedaten"]
["Verwacht","Attendu","Required","Erwarted"]
["Berekende gegevens","Donneés calculées","Calculated data","Berechneten Daten"]
["koeling & verwarming","refroidissement & chauffage","cooling & heating","Kühlung & Heizung"]
["Luchtsnelheid","Vitesse d'air","Air velocity","Luftgeschwindigkeit "]
["Lengte [mm]:","Longueur [mm]:","Length [mm]:","Länge [mm]:"]
["Specificaties gekozen koelbalk","Specifications de la poutre froide sélectionnée","Selected beam specifications ","Spezifikationen des ausgewählten Kuhlbalk"]
["Berekende gegevens - koeling","Donneés calculées - refroidissement","Calculated data - cooling","Berechneten Daten - Külung"]
["Berekende gegevens - verwarming","Donneés calculées - chauffage","Calculated data - heating","Berechneten Daten - Heizung"]
["Invoergegevens - koeling","Donneés - refroidissement","Input data - cooling","Eingabedaten - Kühlung"]
["Invoergegevens-  verwarming","Donneés - chauffage","Input data - heating","Eingabedaten - Heizung"]
["kies","Sélectionnez ","choose","whälen"]
["nominale lengte:","longueur nominal","beam length:","länge:"]
["koud","froid","cool","Kühl"]
["warm","chaud","heat","Wärme"]
["actueel","actuèle","actual","aktuell"]
["gebruiker","utilisateur","user","Benutzer"]
["opmerkingen","remarques","remarks","Anmerkung"]
["lucht","l'air","air","Luft"]
["water","l'eau","water","Wasser"]
["datum","date","date","Datum"]
["klant ID","ID client","customer ID","Kunden ID"]

{"sheet":"velocity","index":8,"n_rows":146,"n_cols":145,"rows_kept":146,"cut":false,"hidden":true,"merged":[[18,11,18,20],[18,36,18,45],[18,72,18,81],[18,97,18,106],[18,123,18,132],[23,134,23,144],[37,46,37,47],[37,82,37,83],[37,133,37,134],[23,83,23,93],[41,0,41,1],[41,3,41,4],[45,0,45,1],[57,11,57,20],[57,36,57,45],[57,97,57,106],[57,123,57,132],[62,83,62,93],[62,134,62,144],[76,46,76,47],[76,82,76,83],[76,133,76,134],[57,72,57,81],[88,11,88,20],[88,36,88,45],[88,72,88,81],[88,97,88,106],[88,123,88,132],[93,134,93,144],[107,46,107,47],[107,82,107,83],[107,133,107,134],[93,83,93,93],[119,11,119,20],[119,36,119,45],[119,72,119,81],[119,97,119,106],[119,123,119,132],[124,134,124,144],[138,46,138,47],[138,82,138,83],[138,133,138,134],[124,83,124,93]]}
["X",{"$f":"selection!B18","v":4},"m",null,"Q prim",{"$f":"capacity!B4","v":86.4},"[m³/h]",null,null,null,null,null,null,null,null,null,"L1 @ 1,8m",{"$f":"B1+(B3-1.8)","v":4.9000000000000004},"m"]
["Y",{"$f":"selection!B19","v":4},"m",null,null,null,null,null,null,null,null,null,null,null,null,null,"L1 @ 2m",{"$f":"B1+(B3-2)","v":4.7},"m"]
["H",2.7,"m",null,null,null,null,null,null,null,null,null,null,null,null,null,"L2",{"$f":"B1+(B3-0.1)+0.5","v":7.1},"m",null,null,null,null,"length beam","[mm]",600,600,600,600,900,900,900,900,1000,1000,1000,1000,1100,1100,1100,1100,1200,1200,1200,1200,1500,1500,1500,1500,1800,1800,1800,1800,2100,2100,2100,2100,2400,2400,2400,2400,2700,2700,2700,2700,2950,2950,2950,2950]
["lengte batt",600,900,1000,1100,1200,1500,1800,2100,2400,2700,2950,"[mm]","Nozzle","inductie",null,"L3 @ 1,8m",{"$f":"B2+(B3-1.8)","v":4.9000000000000004},"m",null,"A",2,null,"nozzle","[]","A","B ","C","D","A","B ","C","D","A","B ","C","D","A","B ","C","D","A","B ","C","D","A","B ","C","D","A","B ","C","D","A","B ","C","D","A","B ","C","D","A","B ","C","D","A","B ","C","D"]
["Qt [m³/h/m]",{"$f":"($F$1+($F$1*$O$5))/((B4-115)/1000)","v":1346.7129834723723},{"$f":"($F$1+($F$1*$O$5))/((C4-115)/1000)","v":832.04560125363128},738.02914913457687,{"$f":"($F$1+($F$1*$O$5))/((E4-115)/1000)","v":663.10233196355387},601.98690966276547,471.59263320151666,387.6295531062911,329.04574155370301,285.84498773921246,252.67148819500989,230.39005184624358,"[m³/h/m]","A",{"$f":"capacity!B13","v":6.5596735762048679},null,"L3 @ 2m",{"$f":"B2+(B3-2)","v":4.7},"m",null,"B",3,null,"v1","[m/s]",{"$f":"HLOOKUP(Z3,$B$11:$L$15,VLOOKUP(Z4,$U$4:$V$7,2,1),1)","v":{"$error":"#N/A"}},{"$f":"HLOOKUP(AA3,$B$11:$L$15,VLOOKUP(AA4,$U$4:$V$7,2,1),1)","v":{"$error":"#N/A"}},{"$error":"#N/A"},{"$error":"#N/A"},{"$error":"#N/A"},{"$error":"#N/A"},{"$error":"#N/A"},{"$error":"#N/A"},{"$f":"HLOOKUP(AH3,$B$11:$L$15,VLOOKUP(AH4,$U$4:$V$7,2,1),1)","v":{"$error":"#N/A"}},{"$error":"#N/A"},{"$error":"#N/A"},{"$f":"HLOOKUP(AK3,$B$11:$L$15,VLOOKUP(AK4,$U$4:$V$7,2,1),1)","v":8.0253261461447581E-2},{"$error":"#N/A"},{"$error":"#N/A"},{"$error":"#N/A"},7.1805724250006892E-2,{"$error":"#N/A"},{"$error":"#N/A"},7.6566951070340838E-2,6.6467869323422982E-2,{"$error":"#N/A"},7.3029012089111042E-2,6.3095984235408062E-2,5.8555479826519846E-2,7.0677727074830499E-2,6.3181308673599307E-2,5.7909563665086497E-2,5.5167733771901081E-2,6.2961239414008288E-2,5.8555704877079714E-2,5.5142061320352688E-2,5.3470622046129818E-2,5.8929708052149102E-2,5.6055036916478632E-2,5.3671135701012895E-2,5.233795684790201E-2,5.6636680781493878E-2,5.442922204928187E-2,5.25690233770508E-2,5.1649376443987746E-2,5.5140400365828221E-2,5.3504115271248306E-2,5.2025431283322689E-2,5.1186881963404526E-2]
["Qt [m³/h/m]",{"$f":"($F$1+($F$1*$O$6))/((B$4-115)/1000)","v":1149.9955953396432},{"$f":"($F$1+($F$1*$O$6))/((C$4-115)/1000)","v":710.50683278946099},630.22357484714905,566.24148603017954,514.05333063569299,402.70603880124685,331.0076342669002,280.98129155653749,244.09096881388484,215.76319680453651,{"$f":"($F$1+($F$1*$O$6))/((L$4-115)/1000)","v":196.73645987291954},"[m³/h/m]","B",{"$f":"capacity!C13","v":5.4554150895801721},null,null,null,null,null,"C",4,null,"v2","[m/s]",{"$f":"HLOOKUP(Z3,$Q$11:$AA$15,VLOOKUP(Z4,$U$4:$V$7,2,1),1)","v":{"$error":"#N/A"}},{"$f":"HLOOKUP(AA3,$Q$11:$AA$15,VLOOKUP(AA4,$U$4:$V$7,2,1),1)","v":{"$error":"#N/A"}},{"$error":"#N/A"},{"$f":"HLOOKUP(AC3,$Q$11:$AA$15,VLOOKUP(AC4,$U$4:$V$7,2,1),1)","v":{"$error":"#N/A"}},{"$error":"#N/A"},{"$error":"#N/A"},{"$error":"#N/A"},{"$error":"#N/A"},{"$error":"#N/A"},{"$error":"#N/A"},{"$error":"#N/A"},0.11717621402580217,{"$error":"#N/A"},{"$error":"#N/A"},{"$error":"#N/A"},0.10219176952202288,{"$error":"#N/A"},{"$error":"#N/A"},0.11090121008704293,9.1168126736451777E-2,{"$error":"#N/A"},0.10458533487430888,8.3272578681722886E-2,7.0939014600598649E-2,9.9905070620901357E-2,8.3479208628144758E-2,6.8834651177351935E-2,5.9895954329684128E-2,8.2946267535506449E-2,7.0939747804371608E-2,5.9794224160822876E-2,5.3170945535190681E-2,7.2069807227272825E-2,6.279269327287279E-2,5.3965504945763305E-2,4.8425394363263125E-2,6.4687660681921305E-2,5.6969513038853004E-2,4.953893471094481E-2,4.5107033780247829E-2,5.9787642429275867E-2,5.3303666457483183E-2,4.6919292085607051E-2,4.2878211342802217E-2]
["Qt [m³/h/m]",{"$f":"($F$1+($F$1*$O$7))/((B$4-115)/1000)","v":943.07641740212705},{"$f":"($F$1+($F$1*$O$7))/((C$4-115)/1000)","v":582.66504769430776},516.82718919777585,464.35742379698644,421.55950455302457,330.24697649099755,271.44929521663596,230.42421281613682,200.1715809365565,176.94083653386136,161.33758816226864,"[m³/h/m]","C",{"$f":"capacity!D13","v":4.29388961157444},null,null,null,null,null,"D",5,null,"v3","[m/s]",{"$f":"HLOOKUP(Z3,$AF$11:$AP$15,VLOOKUP(Z4,$U$4:$V$7,2,1),1)","v":{"$error":"#N/A"}},{"$f":"HLOOKUP(AA3,$AF$11:$AP$15,VLOOKUP(AA4,$U$4:$V$7,2,1),1)","v":{"$error":"#N/A"}},{"$error":"#N/A"},{"$error":"#N/A"},{"$error":"#N/A"},{"$error":"#N/A"},{"$error":"#N/A"},{"$error":"#N/A"},{"$error":"#N/A"},{"$error":"#N/A"},{"$error":"#N/A"},0.66610966147529715,{"$error":"#N/A"},{"$error":"#N/A"},{"$error":"#N/A"},0.57155253943932727,{"$error":"#N/A"},{"$error":"#N/A"},0.62707750146618413,0.52301097688628229,{"$error":"#N/A"},0.58297462111434606,0.47723188576611242,0.40399390582152861,0.5624721656797026,0.47834383557250565,0.38703993611359233,0.31484410401935237,0.47547588852494516,0.40399981293548959,0.31347551734958667,0.22437185283541117,0.4105334182055359,0.33836242625119228,0.23506114422083679,0.17237009810512591,0.35362938047384634,0.27547438129781154,0.17824051991874632,0.15487618655306787,0.31338697262229454,0.22615736137316111,0.16443014722440297,0.14312616071636811]
["Qt [m³/h/m]",{"$f":"($F$1+($F$1*$O$8))/((B$4-115)/1000)","v":802.38039303573726},{"$f":"($F$1+($F$1*$O$8))/((C$4-115)/1000)","v":495.73820461443637},439.72258827382211,395.08070113942392,358.66773329247241,280.97797156847116,230.95221995390656,196.047602328631,170.30831099445626,150.54332325815574,137.2678979267487,"[m³/h/m]","D",{"$f":"capacity!E13","v":3.504102900721441}]
[]
[]
["lengte",600,900,1000,1100,1200,1500,1800,2100,2400,2700,2950,"[mm]","Nozzle",null,"lengte",600,900,1000,1100,1200,1500,1800,2100,2400,2700,2950,"[mm]","Nozzle",null,"lengte",600,900,1000,1100,1200,1500,1800,2100,2400,2700,2950,"[mm]","Nozzle"]
["v1 @1,8m",{"$f":"AV28","v":{"$error":"#N/A"}},{"$f":"AW28","v":{"$error":"#N/A"}},{"$error":"#N/A"},{"$error":"#N/A"},{"$f":"AZ28","v":{"$error":"#N/A"}},{"$error":"#N/A"},7.0677727074830499E-2,6.2961239414008288E-2,5.8929708052149102E-2,5.6636680781493878E-2,5.5140400365828221E-2,"[m³/h/m]","A",null,"v2",{"$f":"CF28","v":{"$error":"#N/A"}},{"$f":"CG28","v":{"$error":"#N/A"}},{"$error":"#N/A"},{"$error":"#N/A"},{"$error":"#N/A"},{"$error":"#N/A"},9.9905070620901357E-2,8.2946267535506449E-2,7.2069807227272825E-2,6.4687660681921305E-2,5.9787642429275867E-2,"[m³/h/m]","A",null,"v3 @ 1,8m",{"$f":"EE28","v":{"$error":"#N/A"}},{"$f":"EF28","v":{"$error":"#N/A"}},{"$error":"#N/A"},{"$error":"#N/A"},{"$error":"#N/A"},{"$error":"#N/A"},0.5624721656797026,0.47547588852494516,0.4105334182055359,0.35362938047384634,0.31338697262229454,"[m³/h/m]","A"]
["v1 @1,8m",{"$f":"AV67","v":{"$error":"#N/A"}},{"$f":"AW67","v":{"$error":"#N/A"}},{"$error":"#N/A"},{"$error":"#N/A"},{"$error":"#N/A"},7.3029012089111042E-2,6.3181308673599307E-2,5.8555704877079714E-2,5.6055036916478632E-2,5.442922204928187E-2,5.3504115271248306E-2,"[m³/h/m]","B",null,"v2",{"$f":"CF67","v":{"$error":"#N/A"}},{"$f":"CG67","v":{"$error":"#N/A"}},{"$error":"#N/A"},{"$error":"#N/A"},{"$error":"#N/A"},0.10458533487430888,8.3479208628144758E-2,7.0939747804371608E-2,6.279269327287279E-2,5.6969513038853004E-2,5.3303666457483183E-2,"[m³/h/m]","B",null,"v3 @ 1,8m",{"$f":"EE67","v":{"$error":"#N/A"}},{"$f":"EF67","v":{"$error":"#N/A"}},{"$error":"#N/A"},{"$error":"#N/A"},{"$error":"#N/A"},0.58297462111434606,0.47834383557250565,0.40399981293548959,0.33836242625119228,0.27547438129781154,0.22615736137316111,"[m³/h/m]","B"]
["v1 @1,8m",{"$f":"AV98","v":{"$error":"#N/A"}},{"$f":"AW98","v":{"$error":"#N/A"}},{"$error":"#N/A"},{"$error":"#N/A"},7.6566951070340838E-2,6.3095984235408062E-2,5.7909563665086497E-2,5.5142061320352688E-2,5.3671135701012895E-2,5.25690233770508E-2,5.2025431283322689E-2,"[m³/h/m]","C",null,"v2",{"$f":"CF98","v":{"$error":"#N/A"}},{"$f":"CG98","v":{"$error":"#N/A"}},{"$error":"#N/A"},{"$error":"#N/A"},0.11090121008704293,8.3272578681722886E-2,6.8834651177351935E-2,5.9794224160822876E-2,5.3965504945763305E-2,4.953893471094481E-2,4.6919292085607051E-2,"[m³/h/m]","C",null,"v3 @ 1,8m",{"$f":"EE98","v":{"$error":"#N/A"}},{"$f":"EF98","v":{"$error":"#N/A"}},{"$error":"#N/A"},{"$error":"#N/A"},0.62707750146618413,0.47723188576611242,0.38703993611359233,0.31347551734958667,0.23506114422083679,0.17824051991874632,0.16443014722440297,"[m³/h/m]","C"]
["v1 @1,8m",{"$f":"AV129","v":{"$error":"#N/A"}},{"$f":"AW129","v":{"$error":"#N/A"}},8.0253261461447581E-2,7.1805724250006892E-2,6.6467869323422982E-2,5.8555479826519846E-2,5.5167733771901081E-2,5.3470622046129818E-2,5.233795684790201E-2,5.1649376443987746E-2,5.1186881963404526E-2,"[m³/h/m]","D",null,"v2",{"$f":"CF129","v":{"$error":"#N/A"}},{"$f":"CG129","v":{"$error":"#N/A"}},0.11717621402580217,0.10219176952202288,9.1168126736451777E-2,7.0939014600598649E-2,5.9895954329684128E-2,5.3170945535190681E-2,4.8425394363263125E-2,4.5107033780247829E-2,4.2878211342802217E-2,"[m³/h/m]","D",null,"v3 @ 1,8m",{"$f":"EE129","v":{"$error":"#N/A"}},{"$f":"EF129","v":{"$error":"#N/A"}},0.66610966147529715,0.57155253943932727,0.52301097688628229,0.40399390582152861,0.31484410401935237,0.22437185283541117,0.17237009810512591,0.15487618655306787,0.14312616071636811,"[m³/h/m]","D"]
[]
["A nozzle","A nozzle","A nozzle","A nozzle","A nozzle","A nozzle","A nozzle","A nozzle","A nozzle","A nozzle","A nozzle","A nozzle","A nozzle","A nozzle","A nozzle","A nozzle","A nozzle","A nozzle","A nozzle","A nozzle","A nozzle","A nozzle","A nozzle","A nozzle","A nozzle","A nozzle","A nozzle","A nozzle","A nozzle","A nozzle","A nozzle","A nozzle","A nozzle","A nozzle","A nozzle","A nozzle","A nozzle","A nozzle","A nozzle","A nozzle","A nozzle","A nozzle","A nozzle","A nozzle","A nozzle","A nozzle","A nozzle","A nozzle","A nozzle","A nozzle","A nozzle","A nozzle","A nozzle","A nozzle","A nozzle","A nozzle","A nozzle","A nozzle","A nozzle","A nozzle","A nozzle","A nozzle","A nozzle","A nozzle","A nozzle","A nozzle","A nozzle","A nozzle","A nozzle","A nozzle","A nozzle","A nozzle","A nozzle","A nozzle","A nozzle","A nozzle","A nozzle","A nozzle","A nozzle","A nozzle","A nozzle","A nozzle","A nozzle","A nozzle","A nozzle","A nozzle","A nozzle","A nozzle","A nozzle","A nozzle","A nozzle","A nozzle","A nozzle","A nozzle","A nozzle","A nozzle","A nozzle","A nozzle","A nozzle","A nozzle","A nozzle","A nozzle","A nozzle","A nozzle","A nozzle","A nozzle","A nozzle","A nozzle","A nozzle","A nozzle","A nozzle","A nozzle","A nozzle","A nozzle","A nozzle","A nozzle","A nozzle","A nozzle","A nozzle","A nozzle","A nozzle","A nozzle","A nozzle","A nozzle","A nozzle","A nozzle","A nozzle","A nozzle","A nozzle","A nozzle","A nozzle","A nozzle","A nozzle","A nozzle","A nozzle","A nozzle","A nozzle","A nozzle","A nozzle","A nozzle","A nozzle","A nozzle","A nozzle","A nozzle","A nozzle"]
[]
[null,null,null,null,null,null,null,null,null,null,null,"V1 (h=2m)",null,null,null,null,null,null,null,null,null,null,null,null,null,null,null,null,null,null,null,null,null,null,null,null,"v1 (h=1,8m)",null,null,null,null,null,null,null,null,null,null,null,null,null,null,null,null,null,null,null,null,null,null,null,null,null,null,null,null,null,null,null,null,null,null,null,"v2 ",null,null,null,null,null,null,null,null,null,null,null,null,null,null,null,null,null,null,null,null,null,null,null,null,"V3 (h =2)",null,null,null,null,null,null,null,null,null,null,null,null,null,null,null,null,null,null,null,null,null,null,null,null,null,"V3 (h =1,8)"]
[]
[null,null,null,null,null,null,null,null,"lengte test batt",1.085,"m",null,0.5,1,1.5,2,2.5,3,3.5,4.18,"x [m]",null,null,null,null,null,null,null,null,null,null,null,null,null,null,null,null,0.5,1,1.5,2,2.5,3,3.5,4.18,"x [m]",null,null,null,null,null,null,null,null,null,null,null,null,null,null,null,null,null,null,null,null,null,null,null,null,null,null,null,0.5,1,1.5,2,2.5,3,3.5,4.18,"x [m]",null,null,null,null,null,null,null,null,null,null,null,null,null,null,null,null,0.5,1,1.5,2,2.5,3,3.5,4.18,"x [m]",null,null,null,null,null,null,null,null,null,null,null,null,null,null,null,null,null,0.5,1,1.5,2,2.5,3,3.5,4.18,"x [m]"]
[]
[null,null,null,null,null,null,null,null,null,null,null,null,{"$f":"IF(M25-$W$26<=0,10000,(M25-$W$26))","v":1.2000000000000002},{"$f":"IF(N25-$W$26<=0,10000,(N25-$W$26))","v":1.7000000000000002},2.2000000000000002,2.7,3.2,3.7,4.2,4.88,"L3max",{"$f":"MIN(M23:T23)","v":1.2000000000000002},null,null,null,null,null,null,null,null,null,null,null,null,null,null,null,{"$f":"IF(AL25-$AV$26<=0,10000,(AL25-$AV$26))","v":10000},{"$f":"IF(AM25-$AV$26<=0,10000,(AM25-$AV$26))","v":10000},10000,10000,10000,10000,10000,0.17999999999999972,"L3max",{"$f":"MIN(AL23:AS23)","v":0.17999999999999972},null,null,null,null,null,null,null,null,null,null,null,null,null,null,null,null,null,null,null,null,null,null,null,null,null,null,{"$f":"IF(BV25-$CF$26<=0,10000,(BV25-$CF$26))","v":10000},{"$f":"IF(BW25-$CF$26<=0,10000,(BW25-$CF$26))","v":10000},10000,10000,10000,10000,10000,0.17999999999999972,"L3max",{"$f":"MIN(BV23:CC23)","v":0.17999999999999972},null,null,null,null,null,null,null,null,null,null,null,null,null,null,null,{"$f":"IF(CU25-$DE$26<=0,10000,(CU25-$DE$26))","v":1.2000000000000002},{"$f":"IF(CV25-$DE$26<=0,10000,(CV25-$DE$26))","v":1.7000000000000002},2.2000000000000002,2.7,3.2,3.7,4.2,4.88,"L3max",{"$f":"MIN(CU23:DB23)","v":1.2000000000000002},null,null,null,null,null,null,null,null,null,null,null,null,null,null,null,null,{"$f":"IF(DU25-$EE$26<=0,10000,(DU25-$EE$26))","v":10000},{"$f":"IF(DV25-$EE$26<=0,10000,(DV25-$EE$26))","v":10000},10000,10000,10000,10000,10000,0.17999999999999972,"L3max",{"$f":"MIN(DU23:EB23)","v":0.17999999999999972}]
[null,null,null,"plenum",null,"inductie",null,null,null,null,null,"2 sides",1,2,3,4,5,6,7,8,"index",null,null,null,null,null,null,null,null,null,null,null,null,null,null,null,"2 sides",1,2,3,4,5,6,7,8,"index",null,null,null,null,null,null,null,null,null,null,null,null,null,null,null,null,null,null,null,null,null,null,null,null,null,null,null,1,2,3,4,5,6,7,8,"index",null,"beam",null,null,null,null,null,null,null,null,null,null,null,null,null,"2 sides",1,2,3,4,5,6,7,8,"index",null,null,null,null,null,null,null,null,null,null,null,null,null,null,null,null,"2 sides",1,2,3,4,5,6,7,8,"index",null,"beam"]
["koelbalk","meetinstrument","ΔP mi [Pa]","Ps [Pa]","Qp [m³/h]","i []","Qsec [m³/h]","Qt [m³/h]",null,null,null,"Qt [m³/h/m]",{"$f":"M21+(2.7-2)","v":1.2000000000000002},{"$f":"N21+(2.7-2)","v":1.7000000000000002},2.2000000000000002,2.7,3.2,3.7,4.2,4.88,"L1  h 2m [m]",null,null,null,600,900,1000,1100,1200,1500,1800,2100,2400,2700,2950,null,"Q [m³/h/m]",{"$f":"AL21+(2.7-1.8)","v":1.4000000000000001},1.9000000000000001,2.4000000000000004,2.9000000000000004,3.4000000000000004,3.9000000000000004,4.4000000000000004,5.08,"L1  h=1,8m [m]",null,600,900,1000,1100,1200,1500,1800,2100,2400,2700,2950,null,null,600,900,1000,1100,1200,1500,1800,2100,2400,2700,2950,null,"Q [m³/h/m]",{"$f":"BV21+2.6+0.5","v":3.6},4.0999999999999996,4.5999999999999996,5.0999999999999996,5.6,6.1,6.6,7.2799999999999994,"L2   [m]",null,600,900,1000,1100,1200,1500,1800,2100,2400,2700,2950,null,null,null,"Q [m³/h/m]",{"$f":"CU21+(2.7-2)","v":1.2000000000000002},{"$f":"CV21+(2.7-2)","v":1.7000000000000002},{"$f":"CW21+(2.7-2)","v":2.2000000000000002},2.7,3.2,3.7,4.2,4.88,"L3  h 2 [m]",null,null,null,null,600,900,1000,1100,1200,1500,1800,2100,2400,2700,2950,null,"Q [m³/h/m]",{"$f":"DU21+(2.7-1.8)","v":1.4000000000000001},1.9000000000000001,2.4000000000000004,2.9000000000000004,3.4000000000000004,3.9000000000000004,4.4000000000000004,5.08,"L3  h 1,8m [m]",null,600,900,1000,1100,1200,1500,1800,2100,2400,2700,2950]
["KT64A_1200",null,null,20,{"$f":"$A$47*D26^$A$48","v":12.595854438014243},{"$f":"$O$5","v":6.5596735762048679},{"$f":"E26*F26","v":82.624693526764844},{"$f":"E26+G26","v":95.220547964779087},null,{"$f":"IF(L26-$W$27<=0,10000,L26-$W$27)","v":87.760873700257221},1,{"$f":"H26/$J$21","v":87.760873700257221},null,null,null,null,null,null,null,null,null,null,null,null,{"$f":"IF($AK26-AV$27<=0,10000,$AK26-AV$27)","v":10000},10000,10000,10000,10000,10000,10000,10000,10000,10000,10000,1,{"$f":"L26","v":87.760873700257221},5.3895284475259042E-2,5.3102512382340677E-2,5.2390364363284515E-2,5.1750641036018202E-2,5.1175976886855684E-2,5.0659755466974259E-2,5.0196033213319238E-2,4.9640114235091376E-2,null,"L1 @ 1,8m",{"$f":"$R$1","v":4.9000000000000004},4.9000000000000004,4.9000000000000004,4.9000000000000004,4.9000000000000004,4.9000000000000004,4.9000000000000004,4.9000000000000004,4.9000000000000004,4.9000000000000004,4.9000000000000004,null,null,{"$f":"IF($BU26-CF$27<=0,10000,$BU26-CF$27)","v":10000},10000,10000,10000,10000,10000,10000,10000,10000,10000,10000,1,{"$f":"AK26","v":87.760873700257221},4.0470077838627563E-2,3.9688775731292619E-2,3.8917371989653352E-2,3.8155741210690153E-2,3.7403759580122292E-2,3.6661304852279863E-2,3.5928256330231154E-2,3.494619147455201E-2,null,"L2",{"$f":"$R$3","v":7.1},7.1,7.1,7.1,7.1,7.1,7.1,7.1,7.1,7.1,7.1,null,{"$f":"IF(CT26-$DE$27<=0,10000,CT26-$DE$27)","v":87.760873700257221},1,{"$f":"BU26","v":87.760873700257221},null,null,null,null,null,null,null,null,null,null,null,null,null,{"$f":"IF($DT26-EE$27<=0,10000,$DT26-EE$27)","v":10000},10000,10000,10000,10000,10000,10000,10000,10000,10000,10000,1,{"$f":"CT26","v":87.760873700257221},0.12,0.05,1.0000000000000001E-5,1.0000000000000001E-5,1.0000000000000001E-5,1.0000000000000001E-5,1.0000000000000001E-5,1.0000000000000001E-5,null,"L3",{"$f":"$R$4","v":4.9000000000000004},4.9000000000000004,4.9000000000000004,4.9000000000000004,4.9000000000000004,4.9000000000000004,4.9000000000000004,4.9000000000000004,4.9000000000000004,4.9000000000000004,4.9000000000000004]
["KT64A_1200",null,null,35,{"$f":"$A$47*D27^$A$48","v":16.619910566038225},{"$f":"$O$5","v":6.5596735762048679},{"$f":"E27*F27","v":109.02118817892904},{"$f":"E27+G27","v":125.64109874496727},null,{"$f":"IF(L27-$W$27<=0,10000,L27-$W$27)","v":115.79824769121407},2,{"$f":"H27/$J$21","v":115.79824769121407},null,null,null,null,null,null,null,null,null,null,null,null,10000,10000,10000,10000,10000,10000,10000,10000,10000,10000,10000,2,{"$f":"L27","v":115.79824769121407},5.5364704737271481E-2,5.4422494175469849E-2,5.3576105419969183E-2,5.2815793495564353E-2,5.2132804480604873E-2,5.15192747179085E-2,5.0968140275817066E-2,5.0307429918488432E-2,null,"Q1",{"$f":"B5","v":1346.7129834723723},{"$f":"C5","v":832.04560125363128},738.02914913457687,663.10233196355387,601.98690966276547,471.59263320151666,387.6295531062911,329.04574155370301,285.84498773921246,252.67148819500989,230.39005184624358,null,null,10000,10000,10000,10000,10000,10000,10000,10000,10000,10000,10000,2,{"$f":"AK27","v":115.79824769121407},4.4920708561285494E-2,4.4083021132503716E-2,4.3255946418612759E-2,4.2439349966458026E-2,4.1633099026280443E-2,4.083706253013597E-2,4.0051111070588674E-2,3.899817216753497E-2,null,"Q2",{"$f":"B5","v":1346.7129834723723},{"$f":"C5","v":832.04560125363128},738.02914913457687,663.10233196355387,601.98690966276547,471.59263320151666,387.6295531062911,329.04574155370301,285.84498773921246,252.67148819500989,230.39005184624358,null,{"$f":"IF(CT27-$DE$27<=0,10000,CT27-$DE$27)","v":115.79824769121407},2,{"$f":"BU27","v":115.79824769121407},null,null,null,null,null,null,null,null,null,null,null,null,null,{"$f":"IF($DT27-EE$27<=0,10000,$DT27-EE$27)","v":10000},10000,10000,10000,10000,10000,10000,10000,10000,10000,10000,2,{"$f":"CT27","v":115.79824769121407},0.23,0.16,7.0000000000000007E-2,0.05,0.04,0.03,0.02,0.01,null,"Q3",{"$f":"B5","v":1346.7129834723723},{"$f":"C5","v":832.04560125363128},738.02914913457687,663.10233196355387,601.98690966276547,471.59263320151666,387.6295531062911,329.04574155370301,285.84498773921246,252.67148819500989,{"$f":"L5","v":230.39005184624358}]
["KT64D_1200","orifice 100",39,15,{"$f":"$A$43*D28^$A$44","v":30.454774811878131},{"$f":"$O$8","v":3.504102900721441},{"$f":"E28*F28","v":106.71666475912043},{"$f":"E28+G28","v":137.17143957099856},null,126.42528992718762,3,126.42528992718762,null,null,null,null,null,null,null,null,null,null,null,null,10000,10000,10000,10000,10000,10000,10000,10000,10000,10000,10000,3,126.42528992718762,5.6055635508297855E-2,5.5043158026135998E-2,5.4133648420914837E-2,5.3316634969688949E-2,5.2582710912535406E-2,5.19234261469535E-2,5.1331189936828218E-2,5.0621206005267073E-2,null,"v1",{"$f":"FORECAST(AV27,AV44:AV45,AV31:AV32)","v":{"$error":"#N/A"}},{"$f":"FORECAST(AW27,AW44:AW45,AW31:AW32)","v":{"$error":"#N/A"}},{"$error":"#N/A"},{"$error":"#N/A"},{"$error":"#N/A"},{"$error":"#N/A"},7.0677727074830499E-2,6.2961239414008288E-2,5.8929708052149102E-2,5.6636680781493878E-2,5.5140400365828221E-2,null,null,10000,10000,10000,10000,10000,10000,10000,10000,10000,10000,10000,3,{"$f":"AK28","v":126.42528992718762},4.6867855120326762E-2,4.6005499168929376E-2,4.5154068459492325E-2,4.4313424579435864E-2,4.3483430869737966E-2,4.2663952402718336E-2,4.185485596010402E-2,4.0770909731107002E-2,null,"v2",{"$f":"FORECAST(CF27,CF44:CF45,CF31:CF32)","v":{"$error":"#N/A"}},{"$f":"FORECAST(CG27,CG44:CG45,CG31:CG32)","v":{"$error":"#N/A"}},{"$error":"#N/A"},{"$error":"#N/A"},{"$error":"#N/A"},{"$error":"#N/A"},9.9905070620901357E-2,8.2946267535506449E-2,7.2069807227272825E-2,6.4687660681921305E-2,5.9787642429275867E-2,null,126.42528992718762,3,{"$f":"BU28","v":126.42528992718762},null,null,null,null,null,null,null,null,null,null,null,null,null,10000,10000,10000,10000,10000,10000,10000,10000,10000,10000,10000,3,{"$f":"CT28","v":126.42528992718762},0.33,0.21,0.13,0.1,0.06,0.06,0.06,0.16,null,"v3",{"$f":"FORECAST(EE27,EE44:EE45,EE31:EE32)","v":{"$error":"#N/A"}},{"$f":"FORECAST(EF27,EF44:EF45,EF31:EF32)","v":{"$error":"#N/A"}},{"$error":"#N/A"},{"$error":"#N/A"},{"$error":"#N/A"},{"$error":"#N/A"},0.5624721656797026,0.47547588852494516,0.4105334182055359,0.35362938047384634,0.31338697262229454]
["KT64D_1200","orifice 100",78,30,{"$f":"$A$43*D29^$A$44","v":43.102406995480678},{"$f":"$O$8","v":3.504102900721441},{"$f":"E29*F29","v":151.03526938093998},{"$f":"E29+G29","v":194.13767637642064},null,178.92873398748446,4,178.92873398748446,null,null,null,null,null,null,null,null,null,null,null,null,10000,10000,10000,10000,10000,10000,10000,10000,10000,10000,10000,4,178.92873398748446,5.9922625237430555E-2,5.8516879036136234E-2,5.7254095719859018E-2,5.6119736116112734E-2,5.5100739670701233E-2,5.4185374073819917E-2,5.3363100179021856E-2,5.2377342735171334E-2,null,"L1min",{"$f":"HLOOKUP(AV39,$AL$24:$AS$25,2,0)","v":4.4000000000000004},{"$f":"HLOOKUP(AW39,$AL$24:$AS$25,2,0)","v":4.4000000000000004},4.4000000000000004,4.4000000000000004,4.4000000000000004,4.4000000000000004,4.4000000000000004,4.4000000000000004,4.4000000000000004,4.4000000000000004,4.4000000000000004,null,null,10000,10000,10000,10000,10000,10000,10000,10000,10000,10000,10000,4,178.92873398748446,5.6505321132667499E-2,5.5520867516264505E-2,5.4548886004843811E-2,5.3589218588520407E-2,5.2641709259246577E-2,5.1706203985450297E-2,5.0782550686995331E-2,4.9545132677189366E-2,null,"L2min",{"$f":"HLOOKUP(CF39,$BV$24:$CC$25,2,0)","v":6.6},{"$f":"HLOOKUP(CG39,$BV$24:$CC$25,2,0)","v":6.6},6.6,6.6,6.6,6.6,6.6,6.6,6.6,6.6,6.6,null,178.92873398748446,4,178.92873398748446,null,null,null,null,null,null,null,null,null,null,null,null,null,10000,10000,10000,10000,10000,10000,10000,10000,10000,10000,10000,4,178.92873398748446,0.49,0.39,0.31,0.28000000000000003,0.22,0.19,0.18,0.18,null,"L3min",{"$f":"HLOOKUP(EE39,$DU$24:$EB$25,2,0)","v":4.4000000000000004},{"$f":"HLOOKUP(EF39,$DU$24:$EB$25,2,0)","v":4.4000000000000004},4.4000000000000004,4.4000000000000004,4.4000000000000004,4.4000000000000004,4.4000000000000004,4.4000000000000004,4.4000000000000004,4.4000000000000004,4.4000000000000004]
["KT64D_1200","orifice 100",133,50,{"$f":"$A$43*D30^$A$44","v":55.676244307781992},3.504102900721441,195.09528918017449,250.77153348795648,null,231.12583731608893,5,231.12583731608893,null,null,null,null,null,null,null,null,null,null,null,null,10000,10000,10000,10000,10000,10000,10000,10000,10000,10000,0.73578546984535365,5,231.12583731608893,6.5288012426117065E-2,6.333661208681246E-2,6.1583667074702406E-2,6.0008994695288684E-2,5.8594464812515165E-2,5.7323791105769732E-2,5.6182343555825909E-2,5.481395471818877E-2,null,"L1max",{"$f":"HLOOKUP(AV40,$AL$24:$AS$25,2,0)","v":5.08},5.08,5.08,5.08,5.08,5.08,5.08,5.08,5.08,5.08,5.08,null,null,10000,10000,10000,10000,10000,10000,10000,10000,10000,10000,0.73578546984535365,5,231.12583731608893,6.7500553563040924E-2,6.6376800653211263E-2,6.5267284639901696E-2,6.417182515497187E-2,6.3090244115376864E-2,6.2022365694216985E-2,6.0968016292154731E-2,5.9555504756795746E-2,null,"L2max",{"$f":"HLOOKUP(CF40,$BV$24:$CC$25,2,0)","v":7.2799999999999994},7.2799999999999994,7.2799999999999994,7.2799999999999994,7.2799999999999994,7.2799999999999994,7.2799999999999994,7.2799999999999994,7.2799999999999994,7.2799999999999994,7.2799999999999994,null,231.12583731608893,5,231.12583731608893,null,null,null,null,null,null,null,null,null,null,null,null,null,10000,10000,10000,10000,10000,10000,10000,10000,10000,10000,0.73578546984535365,5,231.12583731608893,0.65,0.53,0.42,0.42,0.37,0.36,0.33,0.31,null,"L3max",{"$f":"HLOOKUP(EE40,$DU$24:$EB$25,2,0)","v":5.08},5.08,5.08,5.08,5.08,5.08,5.08,5.08,5.08,5.08,5.08]
["KT64D_1200","orifice 100",205,75,{"$f":"$A$43*D31^$A$44","v":68.219614630733332},3.504102900721441,239.04854951365152,307.26816414438485,null,283.19646464920265,6,283.19646464920265,null,null,null,null,null,null,null,null,null,null,null,null,10000,10000,10000,10000,10000,10000,10000,10000,10000,30.524976454192768,52.806412802959073,6,283.19646464920265,7.2750154286605126E-2,7.0039862101958825E-2,6.760520373343068E-2,6.5418147516752817E-2,6.3453512577929388E-2,6.1688678910915187E-2,6.0103326940084398E-2,5.8202777115681475E-2,null,"Qmin",{"$f":"VLOOKUP(AV41,$AJ$26:$AK$38,2,0)","v":{"$error":"#N/A"}},{"$f":"VLOOKUP(AW41,$AJ$26:$AK$38,2,0)","v":{"$error":"#N/A"}},{"$error":"#N/A"},{"$error":"#N/A"},{"$error":"#N/A"},{"$error":"#N/A"},365.81055797098225,327.11060806412064,283.19646464920265,231.12583731608893,178.92873398748446,null,null,10000,10000,10000,10000,10000,10000,10000,10000,10000,30.524976454192768,52.806412802959073,6,283.19646464920265,8.0073267040863289E-2,7.8790229630682496E-2,7.752344710240712E-2,7.6272713521912644E-2,7.5037825564067018E-2,7.3818582479677056E-2,7.261478606285382E-2,7.1002060412646437E-2,null,"Qmin",{"$f":"VLOOKUP(CF41,$BT$26:$BU$38,2,0)","v":{"$error":"#N/A"}},{"$f":"VLOOKUP(CG41,$BT$26:$BU$38,2,0)","v":{"$error":"#N/A"}},{"$error":"#N/A"},{"$error":"#N/A"},{"$error":"#N/A"},{"$error":"#N/A"},365.81055797098225,327.11060806412064,283.19646464920265,231.12583731608893,178.92873398748446,null,283.19646464920265,6,283.19646464920265,null,null,null,null,null,null,null,null,null,null,null,null,null,10000,10000,10000,10000,10000,10000,10000,10000,10000,30.524976454192768,52.806412802959073,6,283.19646464920265,0.82,0.63,0.56000000000000005,0.56000000000000005,0.47,0.46,0.43,0.4,null,"Qmin",{"$f":"VLOOKUP(EE41,$DS$26:$DT$38,2,0)","v":{"$error":"#N/A"}},{"$f":"VLOOKUP(EF41,$DS$26:$DT$38,2,0)","v":{"$error":"#N/A"}},{"$error":"#N/A"},{"$error":"#N/A"},{"$error":"#N/A"},{"$error":"#N/A"},365.81055797098225,327.11060806412064,283.19646464920265,231.12583731608893,178.92873398748446]
["KT64D_1200","orifice 100",232,85,72.635325381179186,3.504102900721441,254.52165436303571,327.15697974421488,null,301.5271702711658,7,301.5271702711658,null,null,null,null,null,null,null,null,null,null,null,null,10000,10000,10000,10000,10000,10000,10000,10000,15.682182531953345,48.855682076155915,71.137118424922221,7,301.5271702711658,7.6025434162581895E-2,7.2982049517947442E-2,7.0248173836320038E-2,6.779233038722772E-2,6.5586243590018481E-2,6.3604513460347664E-2,6.182432316510942E-2,5.9690197484964201E-2,null,"Qmax",{"$f":"VLOOKUP(AV42,$AJ$26:$AK$38,2,0)","v":87.760873700257221},87.760873700257221,87.760873700257221,87.760873700257221,87.760873700257221,87.760873700257221,400.8057637723976,346.2244862518063,301.5271702711658,283.19646464920265,231.12583731608893,null,null,10000,10000,10000,10000,10000,10000,10000,10000,15.682182531953345,48.855682076155915,71.137118424922221,7,301.5271702711658,8.4922567212112193E-2,8.3578093712085522E-2,8.2250653431662962E-2,8.0940030575910565E-2,7.9646012083814097E-2,7.8368387593642688E-2,7.7106949408751527E-2,7.5417001101467512E-2,null,"Qmax",{"$f":"VLOOKUP(CF42,$BT$26:$BU$38,2,0)","v":87.760873700257221},87.760873700257221,87.760873700257221,87.760873700257221,87.760873700257221,87.760873700257221,400.8057637723976,346.2244862518063,301.5271702711658,283.19646464920265,231.12583731608893,null,301.5271702711658,7,301.5271702711658,null,null,null,null,null,null,null,null,null,null,null,null,null,10000,10000,10000,10000,10000,10000,10000,10000,15.682182531953345,48.855682076155915,71.137118424922221,7,301.5271702711658,0.88,0.7,0.59,0.53,0.49,0.48,0.47,0.41,null,"Qmax",{"$f":"VLOOKUP(EE42,$DS$26:$DT$38,2,0)","v":87.760873700257221},87.760873700257221,87.760873700257221,87.760873700257221,87.760873700257221,87.760873700257221,400.8057637723976,346.2244862518063,301.5271702711658,283.19646464920265,231.12583731608893]
["KT64D_1200","orifice 100",277,100,78.798157496073785,3.504102900721441,276.11685225349709,354.91500974957086,null,327.11060806412064,8,327.11060806412064,null,null,null,null,null,null,null,null,null,null,null,null,10000,10000,10000,10000,10000,10000,10000,10000,41.265620324908184,74.439119869110755,96.720556217877061,8,327.11060806412064,8.1287572383794915E-2,7.7709033910702108E-2,7.4494428972544005E-2,7.1606745918098763E-2,6.9012737141484343E-2,6.6682536282773638E-2,6.4589314358897615E-2,6.2079920462112581E-2,null,null,null,null,null,null,null,null,null,null,null,null,null,null,null,10000,10000,10000,10000,10000,10000,10000,10000,41.265620324908184,74.439119869110755,96.720556217877061,8,327.11060806412064,9.2090664405737169E-2,9.0655377830078987E-2,8.9238274990610114E-2,8.7839125516429403E-2,8.6457701955219263E-2,8.5093779736269762E-2,8.3747137133971555E-2,8.1943040497665279E-2,null,null,null,null,null,null,null,null,null,null,null,null,null,null,327.11060806412064,8,327.11060806412064,null,null,null,null,null,null,null,null,null,null,null,null,null,10000,10000,10000,10000,10000,10000,10000,10000,41.265620324908184,74.439119869110755,96.720556217877061,8,327.11060806412064,0.96,0.77,0.65,0.6,0.53,0.51,0.48,0.47]
["KT64D_1200","meetbuis 100-80",38,112,83.402527842567665,3.504102900721441,292.25103974064211,375.65356758320979,null,346.2244862518063,9,346.2244862518063,null,null,null,null,null,null,null,null,null,null,null,null,10000,10000,10000,10000,10000,10000,10000,17.178744698103287,60.379498512593841,93.552998056796412,115.83443440556272,9,346.2244862518063,8.5820304552208931E-2,8.1780792066019237E-2,7.8152093678815981E-2,7.4892430036158988E-2,7.1964270699265406E-2,6.9333902034832237E-2,6.6971039050001638E-2,6.4138394366969761E-2,null,"Lmin Q min",{"$f":"INDEX($AL$26:$AS$38,AV41,AV39)","v":6.6971039050001638E-2},{"$f":"INDEX($AL$26:$AS$38,AW41,AW39)","v":6.6971039050001638E-2},6.6971039050001638E-2,6.6971039050001638E-2,6.6971039050001638E-2,6.6971039050001638E-2,6.973311170272159E-2,6.4589314358897615E-2,6.0103326940084398E-2,5.6182343555825909E-2,5.3363100179021856E-2,null,null,10000,10000,10000,10000,10000,10000,10000,17.178744698103287,60.379498512593841,93.552998056796412,115.83443440556272,9,346.2244862518063,9.7767427988578098E-2,9.6260222136902107E-2,9.4772111171261192E-2,9.3302853177339315E-2,9.1852209305648233E-2,9.041994373269889E-2,8.9005823622664904E-2,8.7111327392194099E-2,null,"Lmin Q min",{"$f":"INDEX($BV$26:$CC$38,CF41,CF39)","v":8.9005823622664904E-2},{"$f":"INDEX($BV$26:$CC$38,CG41,CG39)","v":8.9005823622664904E-2},8.9005823622664904E-2,8.9005823622664904E-2,8.9005823622664904E-2,8.9005823622664904E-2,9.4673645851665891E-2,8.3747137133971555E-2,7.261478606285382E-2,6.0968016292154731E-2,5.0782550686995331E-2,null,346.2244862518063,9,346.2244862518063,null,null,null,null,null,null,null,null,null,null,null,null,null,10000,10000,10000,10000,10000,10000,10000,17.178744698103287,60.379498512593841,93.552998056796412,115.83443440556272,9,346.2244862518063,0.99,0.8,0.73,0.63,0.57999999999999996,0.55000000000000004,0.53,0.49,null,"Lmin Q min",{"$f":"INDEX($DU$26:$EB$38,EE41,EE39)","v":0.53},0.53,0.53,0.53,0.53,0.53,0.57999999999999996,0.48,0.43,0.33,0.18]
["KT64D_1200","meetbuis 100-80",44,125,88.120645586259116,3.504102900721441,308.78380981225661,396.90445539851572,null,365.81055797098225,10,365.81055797098225,null,null,null,null,null,null,null,null,null,null,null,null,10000,10000,10000,10000,10000,10000,10000,36.764816417279235,79.965570231769789,113.13906977597236,135.42050612473867,10,365.81055797098225,9.107688840979869E-2,8.6502786967989936E-2,8.2393866750131717E-2,7.8702819323328718E-2,7.5387147471707716E-2,7.2408675900792668E-2,6.973311170272159E-2,6.6525594911256078E-2,null,"Lmax Q min",{"$f":"INDEX($AL$26:$AS$38,AV41,AV40)","v":6.6525594911256078E-2},{"$f":"INDEX($AL$26:$AS$38,AW41,AW40)","v":6.6525594911256078E-2},6.6525594911256078E-2,6.6525594911256078E-2,6.6525594911256078E-2,6.6525594911256078E-2,6.6525594911256078E-2,6.2079920462112581E-2,5.8202777115681475E-2,5.481395471818877E-2,5.2377342735171334E-2,null,null,10000,10000,10000,10000,10000,10000,10000,36.764816417279235,79.965570231769789,113.13906977597236,135.42050612473867,10,365.81055797098225,0.10388585449922633,0.10230113391603253,0.10073649025789835,9.9191669168993413E-2,9.7666419515937394E-2,9.6160493346974629E-2,9.4673645851665891E-2,9.2681716767877037E-2,null,"Lmax Q min",{"$f":"INDEX($BV$26:$CC$38,CF41,CF40)","v":9.2681716767877037E-2},{"$f":"INDEX($BV$26:$CC$38,CG41,CG40)","v":9.2681716767877037E-2},9.2681716767877037E-2,9.2681716767877037E-2,9.2681716767877037E-2,9.2681716767877037E-2,9.2681716767877037E-2,8.1943040497665279E-2,7.1002060412646437E-2,5.9555504756795746E-2,4.9545132677189366E-2,null,365.81055797098225,10,365.81055797098225,null,null,null,null,null,null,null,null,null,null,null,null,null,10000,10000,10000,10000,10000,10000,10000,36.764816417279235,79.965570231769789,113.13906977597236,135.42050612473867,10,365.81055797098225,1.04,0.86,0.79,0.67,0.62,0.6,0.57999999999999996,0.52,null,"Lmax Q min",{"$f":"INDEX($DU$26:$EB$38,EE41,EE40)","v":0.52},{"$f":"INDEX($DU$26:$EB$38,EF41,EF40)","v":0.52},0.52,0.52,0.52,0.52,0.52,0.47,0.4,0.31,0.18]
["KT64D_1200","meetbuis 100-80",53,150,96.550692397235366,3.504102900721441,338.32356129581603,434.8742536930514,null,400.8057637723976,11,400.8057637723976,null,null,null,null,null,null,null,null,null,null,null,null,10000,10000,10000,10000,10000,10000,13.176210666106499,71.760022218694587,114.96077603318514,148.13427557738771,170.41571192615402,11,400.8057637723976,0.10227695199452241,9.6563816066280089E-2,9.1431699950891898E-2,8.6821514554877646E-2,8.2680180082359472E-2,7.8960014895923594E-2,7.5618186529678583E-2,7.1611939695214899E-2,null,"Lmin Q max",{"$f":"INDEX($AL$26:$AS$38,AV42,AV39)","v":5.0196033213319238E-2},{"$f":"INDEX($AL$26:$AS$38,AW42,AW39)","v":5.0196033213319238E-2},5.0196033213319238E-2,5.0196033213319238E-2,5.0196033213319238E-2,5.0196033213319238E-2,7.5618186529678583E-2,6.6971039050001638E-2,6.182432316510942E-2,6.0103326940084398E-2,5.6182343555825909E-2,null,null,10000,10000,10000,10000,10000,10000,13.176210666106499,71.760022218694587,114.96077603318514,148.13427557738771,170.41571192615402,11,400.8057637723976,0.11562786280541335,0.11389438197810287,0.11218286272877107,0.11049302682480078,0.1088245995585215,0.10717730970255146,0.10555088946570576,0.10337197482754852,null,"Lmin Q max",{"$f":"INDEX($BV$26:$CC$38,CF42,CF39)","v":3.5928256330231154E-2},{"$f":"INDEX($BV$26:$CC$38,CG42,CG39)","v":3.5928256330231154E-2},3.5928256330231154E-2,3.5928256330231154E-2,3.5928256330231154E-2,3.5928256330231154E-2,0.10555088946570576,8.9005823622664904E-2,7.7106949408751527E-2,7.261478606285382E-2,6.0968016292154731E-2,null,400.8057637723976,11,400.8057637723976,null,null,null,null,null,null,null,null,null,null,null,null,null,10000,10000,10000,10000,10000,10000,13.176210666106499,71.760022218694587,114.96077603318514,148.13427557738771,170.41571192615402,11,400.8057637723976,1.1599999999999999,0.94,0.83,0.75,0.71,0.65,0.63,0.56000000000000005,null,"Lmin Q max",{"$f":"INDEX($DU$26:$EB$38,EE42,EE39)","v":1.0000000000000001E-5},{"$f":"INDEX($DU$26:$EB$38,EF42,EF39)","v":1.0000000000000001E-5},1.0000000000000001E-5,1.0000000000000001E-5,1.0000000000000001E-5,1.0000000000000001E-5,0.63,0.53,0.47,0.43,0.33]
["KT64D_1200","meetbuis 100-80",62,175,104.30435189237585,3.504102900721441,365.49318202394414,469.79753391631999,null,432.99311881688482,12,432.99311881688482,null,null,null,null,null,null,null,null,null,null,null,null,10000,10000,10000,10000,10000,10000,45.363565710593718,103.94737726318181,147.14813107767236,180.32163062187493,202.60306697064124,12,432.99311881688482,0.11504638307706339,0.10803460966653131,0.1017359261117164,9.6077811937047841E-2,9.0995121921748925E-2,8.642933604431341E-2,8.232788570682642E-2,7.7410989735376426E-2,null,"Lmax Q max",{"$f":"INDEX($AL$26:$AS$38,AV42,AV40)","v":4.9640114235091376E-2},{"$f":"INDEX($AL$26:$AS$38,AW42,AW40)","v":4.9640114235091376E-2},4.9640114235091376E-2,4.9640114235091376E-2,4.9640114235091376E-2,4.9640114235091376E-2,7.1611939695214899E-2,6.4138394366969761E-2,5.9690197484964201E-2,5.8202777115681475E-2,5.481395471818877E-2,null,null,10000,10000,10000,10000,10000,10000,45.363565710593718,103.94737726318181,147.14813107767236,180.32163062187493,202.60306697064124,12,432.99311881688482,0.12741682771296009,0.12553399174538751,0.12367500954548943,0.12183957890837807,0.12002740145781846,0.11823818259772295,0.11647163146426037,0.1141049835115639,null,"Lmax Q max",{"$f":"INDEX($BV$26:$CC$38,CF42,CF40)","v":3.494619147455201E-2},{"$f":"INDEX($BV$26:$CC$38,CG42,CG40)","v":3.494619147455201E-2},3.494619147455201E-2,3.494619147455201E-2,3.494619147455201E-2,3.494619147455201E-2,0.10337197482754852,8.7111327392194099E-2,7.5417001101467512E-2,7.1002060412646437E-2,5.9555504756795746E-2,null,432.99311881688482,12,432.99311881688482,null,null,null,null,null,null,null,null,null,null,null,null,null,10000,10000,10000,10000,10000,10000,45.363565710593718,103.94737726318181,147.14813107767236,180.32163062187493,202.60306697064124,12,432.99311881688482,1.26,1.02,0.93,0.84,0.75,0.72,0.72,0.63,null,"Lmax Q max",{"$f":"INDEX($DU$26:$EB$38,EE42,EE40)","v":1.0000000000000001E-5},{"$f":"INDEX($DU$26:$EB$38,EF42,EF40)","v":1.0000000000000001E-5},1.0000000000000001E-5,1.0000000000000001E-5,1.0000000000000001E-5,1.0000000000000001E-5,0.56000000000000005,0.49,0.41,0.4,0.31]
["KT64D_1200","meetbuis 100-80",71,200,111.52242221029591,3.504102900721441,390.78604316257918,502.30846537287511,null,462.95711094274202,13,462.95711094274202,null,null,null,null,null,null,null,null,null,null,null,null,10000,10000,10000,10000,10000,10000,75.327557836450922,133.91136938903901,177.11212320352956,210.28562274773213,232.56705909649844,13,462.95711094274202,0.12954997078087949,0.12106319801461227,0.11343952096080942,0.10659116370872247,0.10043927706383673,9.491303071037864E-2,8.9948797699925309E-2,8.3997581597820226E-2,null,"Index",null,null,null,null,null,null,null,null,null,null,null,null,null,10000,10000,10000,10000,10000,10000,75.327557836450922,133.91136938903901,177.11212320352956,210.28562274773213,232.56705909649844,13,462.95711094274202,0.13931839033371474,0.13728477271834683,0.13527691913286322,0.13329450317114364,0.13133720256232764,0.1294046991184245,0.12749667868258735,0.12494050435361337,null,"Index",null,null,null,null,null,null,null,null,null,null,null,null,462.95711094274202,13,462.95711094274202,null,null,null,null,null,null,null,null,null,null,null,null,null,10000,10000,10000,10000,10000,10000,75.327557836450922,133.91136938903901,177.11212320352956,210.28562274773213,{"$f":"IF($DT38-EO$27<=0,10000,$DT38-EO$27)","v":232.56705909649844},13,462.95711094274202,1.36,1.08,0.97,0.88,0.82,0.77,0.76,0.69,null,"Index"]
[null,null,null,null,null,null,null,null,null,"Qmax","index",null,null,null,null,null,null,null,null,null,null,null,null,null,"Qmax","Qmax","Qmax","Qmax","Qmax","Qmax","Qmax","Qmax","Qmax","Qmax","Qmax","index",null,null,null,null,null,null,null,null,null,null,"L1min",{"$f":"AV40-1","v":7},{"$f":"AW40-1","v":7},7,7,7,7,7,7,7,7,7,null,null,"Qmax","Qmax","Qmax","Qmax","Qmax","Qmax","Qmax","Qmax","Qmax","Qmax","Qmax","index",null,null,null,null,null,null,null,null,null,null,"L2min",{"$f":"CF40-1","v":7},{"$f":"CG40-1","v":7},7,7,7,7,7,7,7,7,7,null,"Qmax","index",null,null,null,null,null,null,null,null,null,null,null,null,null,null,"Qmax","Qmax","Qmax","Qmax","Qmax","Qmax","Qmax","Qmax","Qmax","Qmax","Qmax","index",null,null,null,null,null,null,null,null,null,null,"L3min",{"$f":"EE40-1","v":7},{"$f":"EF40-1","v":7},7,7,7,7,7,7,7,7,7]
["KT64A_1201",null,null,87,{"$f":"$A$47*D40^$A$48","v":26.093672725470498},{"$f":"$F$26","v":6.5596735762048679},{"$f":"E40*F40","v":171.16597548340647},{"$f":"E40+G40","v":197.25964820887697},null,{"$f":"MIN(J26:J38)","v":87.760873700257221},null,{"$f":"H40/$J$21","v":181.80612738145342},null,null,null,null,null,null,null,null,null,null,null,null,{"$f":"MIN(Y26:Y38)","v":10000},{"$f":"MIN(Z26:Z38)","v":10000},10000,10000,10000,10000,13.176210666106499,17.178744698103287,15.682182531953345,30.524976454192768,0.73578546984535365,null,null,null,null,null,null,null,null,null,null,null,"L1max",{"$f":"HLOOKUP(AU23,AL23:AS24,2,0)","v":8},{"$f":"HLOOKUP($ED$23,$DU$23:$EB$24,2,0)","v":8},8,8,8,8,8,8,8,8,8,null,null,{"$f":"MIN(BI26:BI38)","v":10000},{"$f":"MIN(BJ26:BJ38)","v":10000},10000,10000,10000,10000,13.176210666106499,17.178744698103287,15.682182531953345,30.524976454192768,0.73578546984535365,null,{"$f":"AK40","v":0},7.0000000000000007E-2,7.0000000000000007E-2,0.04,0.04,0.04,0.04,0.04,0.04,null,"L2max",{"$f":"HLOOKUP(CE23,BV23:CC24,2,0)","v":8},{"$f":"HLOOKUP($ED$23,$DU$23:$EB$24,2,0)","v":8},8,8,8,8,8,8,8,8,8,null,{"$f":"MIN(CR26:CR38)","v":87.760873700257221},null,null,null,null,null,null,null,null,null,null,null,null,null,null,null,{"$f":"MIN(DH26:DH38)","v":10000},{"$f":"MIN(DI26:DI38)","v":10000},10000,10000,10000,10000,13.176210666106499,17.178744698103287,15.682182531953345,30.524976454192768,0.73578546984535365,null,{"$f":"CT51","v":0},0.44,0.38,0.3,0.28999999999999998,0.27,0.21,0.17,0.13,null,"L3max",{"$f":"HLOOKUP($ED$23,$DU$23:$EB$24,2,0)","v":8},{"$f":"HLOOKUP($ED$23,$DU$23:$EB$24,2,0)","v":8},8,8,8,8,8,8,8,8,8]
[null,null,null,null,null,null,null,null,null,null,null,null,null,null,null,null,null,null,null,null,null,null,null,null,null,null,null,null,null,null,null,null,null,null,null,null,null,null,null,null,null,null,null,null,null,null,"Qmin",{"$f":"AV42-1","v":0},{"$f":"AW42-1","v":0},0,0,0,0,10,8,6,5,4,null,null,null,null,null,null,null,null,null,null,null,null,null,null,null,null,null,null,null,null,null,null,null,null,"Qmin",{"$f":"CF42-1","v":0},{"$f":"CG42-1","v":0},0,0,0,0,10,8,6,5,4,null,null,null,null,null,null,null,null,null,null,null,null,null,null,null,null,null,null,null,null,null,null,null,null,null,null,null,null,null,null,null,null,null,null,null,null,null,null,null,"Qmin",{"$f":"EE42-1","v":0},{"$f":"EF42-1","v":0},0,0,0,0,10,8,6,5,4]
["factoren D nozzle",null,null,"gemeten",null,"trendanalyse",null,null,null,null,null,"fout",null,null,null,null,null,null,null,{"$f":"ABS(T29-T40)","v":0},null,null,null,null,null,null,null,null,null,null,null,null,null,null,null,null,null,null,null,null,null,null,null,null,null,null,"Qmax",{"$f":"VLOOKUP(Y40,Y26:$AJ$38,12,0)","v":1},{"$f":"VLOOKUP(Z40,Z26:$AJ$38,11,0)","v":1},{"$f":"VLOOKUP(AA40,AA26:$AJ$38,10,0)","v":1},{"$f":"VLOOKUP(AB40,AB26:$AJ$38,9,0)","v":1},{"$f":"VLOOKUP(AC40,AC26:$AJ$38,8,0)","v":1},{"$f":"VLOOKUP(AD40,AD26:$AJ$38,7,0)","v":1},{"$f":"VLOOKUP(AE40,AE26:$AJ$38,6,0)","v":11},{"$f":"VLOOKUP(AF40,AF26:$AJ$38,5,0)","v":9},{"$f":"VLOOKUP(AG40,AG26:$AJ$38,4,0)","v":7},{"$f":"VLOOKUP(AH40,AH26:$AJ$38,3,0)","v":6},{"$f":"VLOOKUP(AI40,AI26:$AJ$38,2,0)","v":5},null,null,null,null,null,null,null,null,null,null,null,null,null,null,"fout",{"$f":"ABS(BV29-BV40)","v":1.3494678867332507E-2},{"$f":"ABS(BW29-BW40)","v":1.4479132483735502E-2},1.454888600484381E-2,1.3589218588520406E-2,1.2641709259246577E-2,1.1706203985450296E-2,1.0782550686995331E-2,9.5451326771893649E-3,null,"Qmax",{"$f":"VLOOKUP(BI40,BI26:BT38,12,0)","v":1},{"$f":"VLOOKUP(BJ40,BJ26:BT38,11,0)","v":1},{"$f":"VLOOKUP(BK40,BK26:BU38,10,0)","v":1},{"$f":"VLOOKUP(BL40,BL26:BV38,9,0)","v":1},{"$f":"VLOOKUP(BM40,BM26:BW38,8,0)","v":1},{"$f":"VLOOKUP(BN40,BN26:BX38,7,0)","v":1},{"$f":"VLOOKUP(BO40,BO26:BY38,6,0)","v":11},{"$f":"VLOOKUP(BP40,BP26:BZ38,5,0)","v":9},{"$f":"VLOOKUP(BQ40,BQ26:CA38,4,0)","v":7},{"$f":"VLOOKUP(BR40,BR26:CB38,3,0)","v":6},{"$f":"VLOOKUP(BS40,BS26:CC38,2,0)","v":5},null,null,null,null,null,null,null,null,null,null,null,null,null,null,null,null,null,null,null,null,null,null,null,null,null,null,null,null,null,null,null,null,null,null,null,null,null,null,null,"Qmax",{"$f":"VLOOKUP(DH40,$DH$26:$DS$38,12,0)","v":1},{"$f":"VLOOKUP(DI40,DI26:DS38,11,0)","v":1},{"$f":"VLOOKUP(DJ40,DJ26:DS37,10,0)","v":1},{"$f":"VLOOKUP(DK40,$DK$26:$DS$38,9,0)","v":1},{"$f":"VLOOKUP(DL40,$DL$26:$DS$38,8,0)","v":1},{"$f":"VLOOKUP(DM40,$DM$26:$DS$38,7,0)","v":1},{"$f":"VLOOKUP(DN40,$DN$26:$DS$38,6,0)","v":11},{"$f":"VLOOKUP(DO40,$DO$26:$DS$38,5,0)","v":9},{"$f":"VLOOKUP(DP40,$DP$26:$DS$38,4,0)","v":7},{"$f":"VLOOKUP(DQ40,$DQ$26:$DS$38,3,0)","v":6},{"$f":"VLOOKUP(DR40,$DR$26:$DS$38,2,0)","v":5}]
[7.84,"a",null,"Ps plenum","qp [m³/h]","qp [m³/h]",null,"Fout [%]"]
[0.50109999999999999,"b",null,15,33.78,{"$f":"$A$43*D44^$A$44","v":30.454774811878131},null,{"$f":"(E44-F44)/(E44/100)","v":9.8437690589753402},null,null,null,null,null,null,null,null,null,null,null,null,null,null,null,null,null,null,null,null,null,null,null,null,null,null,null,null,null,null,null,null,null,null,null,null,null,null,"interp Qmin",{"$f":"FORECAST(AV26,AV34:AV35,AV29:AV30)","v":6.664350659504166E-2},{"$f":"FORECAST(AW26,AW34:AW35,AW29:AW30)","v":6.664350659504166E-2},{"$f":"FORECAST(AX26,AX34:AX35,AX29:AX30)","v":6.664350659504166E-2},6.664350659504166E-2,6.664350659504166E-2,6.664350659504166E-2,6.7374643473702811E-2,6.2744171787732145E-2,{"$f":"FORECAST(BD26,BD34:BD35,BD29:BD30)","v":5.8705863833905775E-2},{"$f":"FORECAST(BE26,BE34:BE35,BE29:BE30)","v":5.5176175292857427E-2},{"$f":"FORECAST(BF26,BF34:BF35,BF29:BF30)","v":5.2638278529131763E-2},null,null,null,null,null,null,null,null,null,null,null,null,null,null,null,null,null,null,null,null,null,null,null,null,"interp Qmin",{"$f":"FORECAST(CF26,CF34:CF35,CF29:CF30)","v":9.1708686229438535E-2},{"$f":"FORECAST(CG26,CG34:CG35,CG29:CG30)","v":9.1708686229438535E-2},{"$f":"FORECAST(CH26,CH34:CH35,CH29:CH30)","v":9.1708686229438535E-2},9.1708686229438535E-2,{"$f":"FORECAST(CJ26,CJ34:CJ35,CJ29:CJ30)","v":9.1708686229438535E-2},9.1708686229438535E-2,9.3208992113585853E-2,8.2420595489628712E-2,{"$f":"FORECAST(CN26,CN34:CN35,CN29:CN30)","v":7.1428958378877805E-2},{"$f":"FORECAST(CO26,CO34:CO35,CO29:CO30)","v":5.9929404869096654E-2},{"$f":"FORECAST(CP26,CP34:CP35,CP29:CP30)","v":4.9872684503314474E-2},null,null,null,null,null,null,null,null,null,null,null,null,null,null,null,null,null,null,null,null,null,null,null,null,null,null,null,null,null,null,null,null,null,null,null,null,null,null,null,"interp Qmin",{"$f":"FORECAST(EE26,EE34:EE35,EE29:EE30)","v":0.52264705882352946},{"$f":"FORECAST(EF26,EF34:EF35,EF29:EF30)","v":0.52264705882352946},{"$f":"FORECAST(EG26,EG34:EG35,EG29:EG30)","v":0.52264705882352946},0.52264705882352946,0.52264705882352946,0.52264705882352946,0.53588235294117648,0.47264705882352942,{"$f":"FORECAST(EM26,EM34:EM35,EM29:EM30)","v":0.40794117647058825},0.31529411764705884,0.18]
[null,null,null,{"$f":"D29","v":30},47.78,{"$f":"$A$43*D45^$A$44","v":43.102406995480678},null,{"$f":"(E45-F45)/(E45/100)","v":9.7898555975707904},null,null,null,null,null,null,null,null,null,null,null,null,null,null,null,null,null,null,null,null,null,null,null,null,null,null,null,null,null,null,null,null,null,null,null,null,null,null,"interp Qmax",{"$f":"FORECAST(AV26,AV36:AV37,AV29:AV30)","v":4.9787269258739927E-2},{"$f":"FORECAST(AW26,AW36:AW37,AW29:AW30)","v":4.9787269258739927E-2},4.9787269258739927E-2,4.9787269258739927E-2,4.9787269258739927E-2,4.9787269258739927E-2,7.2672416798455292E-2,6.4888212077184079E-2,6.0255113106179106E-2,5.8705863833905775E-2,5.5176175292857427E-2,null,null,null,null,null,null,null,null,null,null,null,null,null,null,null,null,null,null,null,null,null,null,null,null,"interp Qmax",{"$f":"FORECAST(CF26,CF36:CF37,CF29:CF30)","v":3.5206149818702369E-2},{"$f":"FORECAST(CG26,CG36:CG37,CG29:CG30)","v":3.5206149818702369E-2},3.5206149818702369E-2,3.5206149818702369E-2,3.5206149818702369E-2,3.5206149818702369E-2,0.10394874634941367,8.761281168849519E-2,7.5864340359277999E-2,7.1428958378877805E-2,5.9929404869096654E-2,null,null,null,null,null,null,null,null,null,null,null,null,null,null,null,null,null,null,null,null,null,null,null,null,null,null,null,null,null,null,null,null,null,null,null,null,null,null,null,"interp Qmax",{"$f":"FORECAST(EE26,EE36:EE37,EE29:EE30)","v":1.0000000000000001E-5},{"$f":"FORECAST(EF26,EF36:EF37,EF29:EF30)","v":1.0000000000000001E-5},1.0000000000000001E-5,1.0000000000000001E-5,1.0000000000000001E-5,1.0000000000000001E-5,0.57852941176470574,0.50058823529411767,0.42588235294117638,0.40794117647058825,0.31529411764705884]
["factoren A nozzle",null,null,50,62.39,55.676244307781992,null,10.76094837669179]
[2.8555999999999999,"a",null,75,77.45,68.219614630733332,null,11.917863614288793]
[0.49540000000000001,"b",null,85,82.4,72.635325381179186,null,11.850333275267984]
[null,null,null,100,90.03,78.798157496073785,null,12.475666448879503]
[null,null,null,112,99.4,83.402527842567665,null,16.094036375686457]
[null,null,null,125,106.9,88.120645586259116,null,17.567216476839,null,null,null,null,null,null,null,null,null,null,null,null,null,null,null,null,null,null,null,null,null,null,null,null,null,null,null,null,null,null,null,null,null,null,null,null,null,null,null,null,null,null,null,null,null,null,null,null,null,null,null,null,null,null,null,null,null,null,null,null,null,null,null,null,null,null,null,null,null,null,null,null,null,null,null,null,null,null,null,null,null,null,null,null,null,null,null,null,null,{"$f":"BU40","v":0},0.43,0.39,0.35,0.28999999999999998,0.28999999999999998,0.25,0.21,0.2]
[null,null,null,150,117.3,96.550692397235366,null,17.689094290506929]
[null,null,null,175,126.8,104.30435189237585,null,17.741047403489077,null,null,null,null,null,null,null,null,null,null,null,null,null,null,null,null,null,null,null,null,null,null,null,null,null,null,null,null,null,null,null,null,null,null,null,null,null,null,null,null,null,null,null,null,null,null,null,null,null,null,null,null,null,null,null,null,null,null,null,null,null,null,null,null,null,null,null,null,null,null,null,null,null,null,null,null,null,null,null,null,null,null,null,null,null,null,null,null,null,"fout",{"$f":"ABS(CU29-CU51)","v":0.43},0.39,0.35,0.28999999999999998,0.28999999999999998,0.25,0.21,0.2]
[null,null,null,200,135.69999999999999,111.52242221029591,null,17.816932785338302]
[]
["B nozzle","B nozzle","B nozzle","B nozzle","B nozzle","B nozzle","B nozzle","B nozzle","B nozzle","B nozzle","B nozzle","B nozzle","B nozzle","B nozzle","B nozzle","B nozzle","B nozzle","B nozzle","B nozzle","B nozzle","B nozzle","B nozzle","B nozzle","B nozzle","B nozzle","B nozzle","B nozzle","B nozzle","B nozzle","B nozzle","B nozzle","B nozzle","B nozzle","B nozzle","B nozzle","B nozzle","B nozzle","B nozzle","B nozzle","B nozzle","B nozzle","B nozzle","B nozzle","B nozzle","B nozzle","B nozzle","B nozzle","B nozzle","B nozzle","B nozzle","B nozzle","B nozzle","B nozzle","B nozzle","B nozzle","B nozzle","B nozzle","B nozzle","B nozzle","B nozzle","B nozzle","B nozzle","B nozzle","B nozzle","B nozzle","B nozzle","B nozzle","B nozzle","B nozzle","B nozzle","B nozzle","B nozzle","B nozzle","B nozzle","B nozzle","B nozzle","B nozzle","B nozzle","B nozzle","B nozzle","B nozzle","B nozzle","B nozzle","B nozzle","B nozzle","B nozzle","B nozzle","B nozzle","B nozzle","B nozzle","B nozzle","B nozzle","B nozzle","B nozzle","B nozzle","B nozzle","B nozzle","B nozzle","B nozzle","B nozzle","B nozzle","B nozzle","B nozzle","B nozzle","B nozzle","B nozzle","B nozzle","B nozzle","B nozzle","B nozzle","B nozzle","B nozzle","B nozzle","B nozzle","B nozzle","B nozzle","B nozzle","B nozzle","B nozzle","B nozzle","B nozzle","B nozzle","B nozzle","B nozzle","B nozzle","B nozzle","B nozzle","B nozzle","B nozzle","B nozzle","B nozzle","B nozzle","B nozzle","B nozzle","B nozzle","B nozzle","B nozzle","B nozzle","B nozzle","B nozzle","B nozzle","B nozzle","B nozzle","B nozzle","B nozzle"]
[]
[null,null,null,null,null,null,null,null,null,null,null,"V1 (h=2m)",null,null,null,null,null,null,null,null,null,null,null,null,null,null,null,null,null,null,null,null,null,null,null,null,"v1 (h=1,8m)",null,null,null,null,null,null,null,null,null,null,null,null,null,null,null,null,null,null,null,null,null,null,null,null,null,null,null,null,null,null,null,null,null,null,null,"v2 ",null,null,null,null,null,null,null,null,null,null,null,null,null,null,null,null,null,null,null,null,null,null,null,null,"V3 (h =2)",null,null,null,null,null,null,null,null,null,null,null,null,null,null,null,null,null,null,null,null,null,null,null,null,null,"V3 (h =1,8)"]
[]
[null,null,null,null,null,null,null,null,null,null,null,null,0.5,1,1.5,2,2.5,3,3.5,4.18,"x [m]",null,null,null,null,null,null,null,null,null,null,null,null,null,null,null,null,0.5,1,1.5,2,2.5,3,3.5,4.18,"x [m]",null,null,null,null,null,null,null,null,null,null,null,null,null,null,null,null,null,null,null,null,null,null,null,null,null,null,null,0.5,1,1.5,2,2.5,3,3.5,4.18,"x [m]",null,null,null,null,null,null,null,null,null,null,null,null,null,null,null,null,0.5,1,1.5,2,2.5,3,3.5,4.18,"x [m]",null,null,null,null,null,null,null,null,null,null,null,null,null,null,null,null,null,0.5,1,1.5,2,2.5,3,3.5,4.18,"x [m]"]
[]
[null,null,null,null,null,null,null,null,null,null,null,null,{"$f":"IF(M64-$W$26<=0,10000,(M64-$W$26))","v":1.2000000000000002},{"$f":"IF(N64-$W$26<=0,10000,(N64-$W$26))","v":1.7000000000000002},2.2000000000000002,2.7,3.2,3.7,4.2,4.88,"L3max",{"$f":"MIN(M62:T62)","v":1.2000000000000002},null,null,null,null,null,null,null,null,null,null,null,null,null,null,null,{"$f":"IF(AL64-$AV$26<=0,10000,(AL64-$AV$26))","v":10000},{"$f":"IF(AM64-$AV$26<=0,10000,(AM64-$AV$26))","v":10000},10000,10000,10000,10000,10000,0.17999999999999972,"L3max",{"$f":"MIN(AL62:AS62)","v":0.17999999999999972},null,null,null,null,null,null,null,null,null,null,null,null,null,null,null,null,null,null,null,null,null,null,null,null,null,null,{"$f":"IF(BV64-$CF$26<=0,10000,(BV64-$CF$26))","v":10000},{"$f":"IF(BW64-$CF$26<=0,10000,(BW64-$CF$26))","v":10000},10000,10000,10000,10000,10000,0.17999999999999972,"L3max",{"$f":"MIN(BV62:CC62)","v":0.17999999999999972},null,null,null,null,null,null,null,null,null,null,null,null,null,null,null,{"$f":"IF(CU64-$DE$26<=0,10000,(CU64-$DE$26))","v":1.2000000000000002},{"$f":"IF(CV64-$DE$26<=0,10000,(CV64-$DE$26))","v":1.7000000000000002},2.2000000000000002,2.7,3.2,3.7,4.2,4.88,"L3max",{"$f":"MIN(CU62:DB62)","v":1.2000000000000002},null,null,null,null,null,null,null,null,null,null,null,null,null,null,null,null,{"$f":"IF(DU64-$EE$26<=0,10000,(DU64-$EE$26))","v":10000},{"$f":"IF(DV64-$EE$26<=0,10000,(DV64-$EE$26))","v":10000},10000,10000,10000,10000,10000,0.17999999999999972,"L3max",{"$f":"MIN(DU62:EB62)","v":0.17999999999999972}]
[null,null,null,null,null,null,null,null,null,null,null,"2 sides",1,2,3,4,5,6,7,8,"index",null,null,null,null,null,null,null,null,null,null,null,null,null,null,null,"2 sides",1,2,3,4,5,6,7,8,"index",null,null,null,null,null,null,null,null,null,null,null,null,null,null,null,null,null,null,null,null,null,null,null,null,null,null,null,1,2,3,4,5,6,7,8,"index",null,"beam",null,null,null,null,null,null,null,null,null,null,null,null,null,"2 sides",1,2,3,4,5,6,7,8,"index",null,null,null,null,null,null,null,null,null,null,null,null,null,null,null,null,"2 sides",1,2,3,4,5,6,7,8,"index",null,"beam"]
[null,null,null,null,null,null,null,"Qt [m³/h]",null,null,null,"Qt [m³/h/m]",{"$f":"M60+(2.7-2)","v":1.2000000000000002},{"$f":"N60+(2.7-2)","v":1.7000000000000002},2.2000000000000002,2.7,3.2,3.7,4.2,4.88,"L1  h 2m [m]",null,null,null,600,900,1000,1100,1200,1500,1800,2100,2400,2700,3000,null,"Q [m³/h/m]",{"$f":"AL60+(2.7-1.8)","v":1.4000000000000001},1.9000000000000001,2.4000000000000004,2.9000000000000004,3.4000000000000004,3.9000000000000004,4.4000000000000004,5.08,"L1  h=1,8m [m]",null,600,900,1000,1100,1200,1500,1800,2100,2400,2700,3000,null,null,600,900,1000,1100,1200,1500,1800,2100,2400,2700,3000,null,"Q [m³/h/m]",{"$f":"BV60+2.6+0.5","v":3.6},4.0999999999999996,4.5999999999999996,5.0999999999999996,5.6,6.1,6.6,7.2799999999999994,"L2   [m]",null,600,900,1000,1100,1200,1500,1800,2100,2400,2700,3000,null,null,null,"Q [m³/h/m]",{"$f":"CU60+(2.7-2)","v":1.2000000000000002},{"$f":"CV60+(2.7-2)","v":1.7000000000000002},{"$f":"CW60+(2.7-2)","v":2.2000000000000002},2.7,3.2,3.7,4.2,4.88,"L3  h 2 [m]",null,null,null,null,600,900,1000,1100,1200,1500,1800,2100,2400,2700,3000,null,"Q [m³/h/m]",{"$f":"DU60+(2.7-1.8)","v":1.4000000000000001},1.9000000000000001,2.4000000000000004,2.9000000000000004,3.4000000000000004,3.9000000000000004,4.4000000000000004,5.08,"L3  h 1,8m [m]",null,600,900,1000,1100,1200,1500,1800,2100,2400,2700,3000]
[null,null,null,null,null,null,null,{"$f":"H26","v":95.220547964779087},null,{"$f":"IF(L65-$W$27<=0,10000,L65-$W$27)","v":87.760873700257221},1,{"$f":"H65/$J$21","v":87.760873700257221},null,null,null,null,null,null,null,null,null,null,null,null,{"$f":"IF($AK65-AV$66<=0,10000,$AK65-AV$66)","v":10000},{"$f":"IF($AK65-AW$66<=0,10000,$AK65-AW$66)","v":10000},10000,10000,10000,10000,10000,10000,10000,10000,10000,1,{"$f":"L65","v":87.760873700257221},5.3895284475259042E-2,5.3102512382340677E-2,5.2390364363284515E-2,5.1750641036018202E-2,5.1175976886855684E-2,5.0659755466974259E-2,5.0196033213319238E-2,4.9640114235091376E-2,null,"L1 @ 1,8m",{"$f":"$R$1","v":4.9000000000000004},4.9000000000000004,4.9000000000000004,4.9000000000000004,4.9000000000000004,4.9000000000000004,4.9000000000000004,4.9000000000000004,4.9000000000000004,4.9000000000000004,4.9000000000000004,null,null,{"$f":"IF($BU65-CF$66<=0,10000,$BU65-CF$66)","v":10000},{"$f":"IF($BU65-CG$66<=0,10000,$BU65-CG$66)","v":10000},10000,10000,10000,10000,10000,10000,10000,10000,10000,1,{"$f":"AK65","v":87.760873700257221},4.0470077838627563E-2,3.9688775731292619E-2,3.8917371989653352E-2,3.8155741210690153E-2,3.7403759580122292E-2,3.6661304852279863E-2,3.5928256330231154E-2,3.494619147455201E-2,null,"L2",{"$f":"$R$3","v":7.1},7.1,7.1,7.1,7.1,7.1,7.1,7.1,7.1,7.1,7.1,null,{"$f":"IF(CT65-$DE$27<=0,10000,CT65-$DE$27)","v":87.760873700257221},1,{"$f":"BU65","v":87.760873700257221},null,null,null,null,null,null,null,null,null,null,null,null,null,{"$f":"IF($DT65-EE$66<=0,10000,$DT65-EE$66)","v":10000},{"$f":"IF($DT65-EF$66<=0,10000,$DT65-EF$66)","v":10000},10000,10000,10000,10000,10000,10000,10000,10000,10000,1,{"$f":"CT65","v":87.760873700257221},0.12,0.05,1.0000000000000001E-5,1.0000000000000001E-5,1.0000000000000001E-5,1.0000000000000001E-5,1.0000000000000001E-5,1.0000000000000001E-5,null,"L3",{"$f":"$R$4","v":4.9000000000000004},4.9000000000000004,4.9000000000000004,4.9000000000000004,4.9000000000000004,4.9000000000000004,4.9000000000000004,4.9000000000000004,4.9000000000000004,4.9000000000000004,4.9000000000000004]
[null,null,null,null,null,null,null,{"$f":"H27","v":125.64109874496727},null,{"$f":"IF(L66-$W$27<=0,10000,L66-$W$27)","v":115.79824769121407},2,{"$f":"H66/$J$21","v":115.79824769121407},null,null,null,null,null,null,null,null,null,null,null,null,{"$f":"IF($AK66-AV$66<=0,10000,$AK66-AV$66)","v":10000},10000,10000,10000,10000,10000,10000,10000,10000,10000,10000,2,{"$f":"L66","v":115.79824769121407},5.5364704737271481E-2,5.4422494175469849E-2,5.3576105419969183E-2,5.2815793495564353E-2,5.2132804480604873E-2,5.15192747179085E-2,5.0968140275817066E-2,5.0307429918488432E-2,null,"Q1",{"$f":"B6","v":1149.9955953396432},{"$f":"C6","v":710.50683278946099},630.22357484714905,566.24148603017954,514.05333063569299,402.70603880124685,331.0076342669002,280.98129155653749,244.09096881388484,215.76319680453651,196.73645987291954,null,null,{"$f":"IF($BU66-CF$66<=0,10000,$BU66-CF$66)","v":10000},10000,10000,10000,10000,10000,10000,10000,10000,10000,10000,2,{"$f":"AK66","v":115.79824769121407},4.4920708561285494E-2,4.4083021132503716E-2,4.3255946418612759E-2,4.2439349966458026E-2,4.1633099026280443E-2,4.083706253013597E-2,4.0051111070588674E-2,3.899817216753497E-2,null,"Q2",{"$f":"B6","v":1149.9955953396432},{"$f":"C6","v":710.50683278946099},630.22357484714905,566.24148603017954,514.05333063569299,402.70603880124685,331.0076342669002,280.98129155653749,244.09096881388484,215.76319680453651,196.73645987291954,null,{"$f":"IF(CT66-$DE$27<=0,10000,CT66-$DE$27)","v":115.79824769121407},2,{"$f":"BU66","v":115.79824769121407},null,null,null,null,null,null,null,null,null,null,null,null,null,{"$f":"IF($DT66-EE$66<=0,10000,$DT66-EE$66)","v":10000},10000,10000,10000,10000,10000,10000,10000,10000,10000,10000,2,{"$f":"CT66","v":115.79824769121407},0.23,0.16,7.0000000000000007E-2,0.05,0.04,0.03,0.02,0.01,null,"Q3",{"$f":"B6","v":1149.9955953396432},{"$f":"C6","v":710.50683278946099},630.22357484714905,566.24148603017954,514.05333063569299,402.70603880124685,331.0076342669002,280.98129155653749,244.09096881388484,215.76319680453651,196.73645987291954]
[null,null,null,null,null,null,null,137.17143957099856,null,126.42528992718762,3,126.42528992718762,null,null,null,null,null,null,null,null,null,null,null,null,10000,10000,10000,10000,10000,10000,10000,10000,10000,10000,10000,3,126.42528992718762,5.6055635508297855E-2,5.5043158026135998E-2,5.4133648420914837E-2,5.3316634969688949E-2,5.2582710912535406E-2,5.19234261469535E-2,5.1331189936828218E-2,5.0621206005267073E-2,null,"v1",{"$f":"FORECAST(AV66,AV83:AV84,AV70:AV71)","v":{"$error":"#N/A"}},{"$f":"FORECAST(AW66,AW83:AW84,AW70:AW71)","v":{"$error":"#N/A"}},{"$error":"#N/A"},{"$error":"#N/A"},{"$error":"#N/A"},7.3029012089111042E-2,6.3181308673599307E-2,5.8555704877079714E-2,5.6055036916478632E-2,5.442922204928187E-2,5.3504115271248306E-2,null,null,10000,10000,10000,10000,10000,10000,10000,10000,10000,10000,10000,3,{"$f":"AK67","v":126.42528992718762},4.6867855120326762E-2,4.6005499168929376E-2,4.5154068459492325E-2,4.4313424579435864E-2,4.3483430869737966E-2,4.2663952402718336E-2,4.185485596010402E-2,4.0770909731107002E-2,null,"v2",{"$f":"FORECAST(CF66,CF83:CF84,CF70:CF71)","v":{"$error":"#N/A"}},{"$f":"FORECAST(CG66,CG83:CG84,CG70:CG71)","v":{"$error":"#N/A"}},{"$error":"#N/A"},{"$error":"#N/A"},{"$error":"#N/A"},0.10458533487430888,8.3479208628144758E-2,7.0939747804371608E-2,6.279269327287279E-2,{"$f":"FORECAST(CO66,CO83:CO84,CO70:CO71)","v":5.6969513038853004E-2},5.3303666457483183E-2,null,126.42528992718762,3,{"$f":"BU67","v":126.42528992718762},null,null,null,null,null,null,null,null,null,null,null,null,null,10000,10000,10000,10000,10000,10000,10000,10000,10000,10000,10000,3,{"$f":"CT67","v":126.42528992718762},0.33,0.21,0.13,0.1,0.06,0.06,0.06,0.16,null,"v3",{"$f":"FORECAST(EE66,EE83:EE84,EE70:EE71)","v":{"$error":"#N/A"}},{"$f":"FORECAST(EF66,EF83:EF84,EF70:EF71)","v":{"$error":"#N/A"}},{"$error":"#N/A"},{"$error":"#N/A"},{"$error":"#N/A"},0.58297462111434606,0.47834383557250565,0.40399981293548959,0.33836242625119228,0.27547438129781154,0.22615736137316111]
[null,null,null,null,null,null,null,194.13767637642064,null,178.92873398748446,4,178.92873398748446,null,null,null,null,null,null,null,null,null,null,null,null,10000,10000,10000,10000,10000,10000,10000,10000,10000,10000,10000,4,178.92873398748446,5.9922625237430555E-2,5.8516879036136234E-2,5.7254095719859018E-2,5.6119736116112734E-2,5.5100739670701233E-2,5.4185374073819917E-2,5.3363100179021856E-2,5.2377342735171334E-2,null,"L1min",{"$f":"HLOOKUP(AV78,$AL$24:$AS$25,2,0)","v":4.4000000000000004},{"$f":"HLOOKUP(AW78,$AL$24:$AS$25,2,0)","v":4.4000000000000004},4.4000000000000004,4.4000000000000004,4.4000000000000004,4.4000000000000004,4.4000000000000004,4.4000000000000004,4.4000000000000004,4.4000000000000004,4.4000000000000004,null,null,10000,10000,10000,10000,10000,10000,10000,10000,10000,10000,10000,4,178.92873398748446,5.6505321132667499E-2,5.5520867516264505E-2,5.4548886004843811E-2,5.3589218588520407E-2,5.2641709259246577E-2,5.1706203985450297E-2,5.0782550686995331E-2,4.9545132677189366E-2,null,"L2min",{"$f":"HLOOKUP(CF78,$BV$24:$CC$25,2,0)","v":6.6},{"$f":"HLOOKUP(CG78,$BV$24:$CC$25,2,0)","v":6.6},6.6,6.6,6.6,6.6,6.6,6.6,6.6,6.6,6.6,null,178.92873398748446,4,178.92873398748446,null,null,null,null,null,null,null,null,null,null,null,null,null,10000,10000,10000,10000,10000,10000,10000,10000,10000,10000,10000,4,178.92873398748446,0.49,0.39,0.31,0.28000000000000003,0.22,0.19,0.18,0.18,null,"L3min",{"$f":"HLOOKUP(EE78,$DU$24:$EB$25,2,0)","v":4.4000000000000004},{"$f":"HLOOKUP(EF78,$DU$24:$EB$25,2,0)","v":4.4000000000000004},4.4000000000000004,4.4000000000000004,4.4000000000000004,4.4000000000000004,4.4000000000000004,4.4000000000000004,4.4000000000000004,4.4000000000000004,4.4000000000000004]
[null,null,null,null,null,null,null,250.77153348795648,null,231.12583731608893,5,231.12583731608893,null,null,null,null,null,null,null,null,null,null,null,null,10000,10000,10000,10000,10000,10000,10000,10000,10000,15.362640511552428,34.389377443169394,5,231.12583731608893,6.5288012426117065E-2,6.333661208681246E-2,6.1583667074702406E-2,6.0008994695288684E-2,5.8594464812515165E-2,5.7323791105769732E-2,5.6182343555825909E-2,5.481395471818877E-2,null,"L1max",{"$f":"HLOOKUP(AV79,$AL$24:$AS$25,2,0)","v":5.08},5.08,5.08,5.08,5.08,5.08,5.08,5.08,5.08,5.08,5.08,null,null,10000,10000,10000,10000,10000,10000,10000,10000,10000,15.362640511552428,34.389377443169394,5,231.12583731608893,6.7500553563040924E-2,6.6376800653211263E-2,6.5267284639901696E-2,6.417182515497187E-2,6.3090244115376864E-2,6.2022365694216985E-2,6.0968016292154731E-2,5.9555504756795746E-2,null,"L2max",{"$f":"HLOOKUP(CF79,$BV$24:$CC$25,2,0)","v":7.2799999999999994},7.2799999999999994,7.2799999999999994,7.2799999999999994,7.2799999999999994,7.2799999999999994,7.2799999999999994,7.2799999999999994,7.2799999999999994,7.2799999999999994,7.2799999999999994,null,231.12583731608893,5,231.12583731608893,null,null,null,null,null,null,null,null,null,null,null,null,null,10000,10000,10000,10000,10000,10000,10000,10000,10000,15.362640511552428,34.389377443169394,5,231.12583731608893,0.65,0.53,0.42,0.42,0.37,0.36,0.33,0.31,null,"L3max",{"$f":"HLOOKUP(EE79,$DU$24:$EB$25,2,0)","v":5.08},5.08,5.08,5.08,5.08,5.08,5.08,5.08,5.08,5.08,5.08]
[null,null,null,null,null,null,null,307.26816414438485,null,283.19646464920265,6,283.19646464920265,null,null,null,null,null,null,null,null,null,null,null,null,10000,10000,10000,10000,10000,10000,10000,2.215173092665168,39.105495835317811,67.433267844666148,86.460004776283114,6,283.19646464920265,7.2750154286605126E-2,7.0039862101958825E-2,6.760520373343068E-2,6.5418147516752817E-2,6.3453512577929388E-2,6.1688678910915187E-2,6.0103326940084398E-2,5.8202777115681475E-2,null,"Qmin",{"$f":"VLOOKUP(AV80,$AJ$65:$AK$77,2,0)","v":{"$error":"#N/A"}},{"$f":"VLOOKUP(AW80,$AJ$65:$AK$77,2,0)","v":{"$error":"#N/A"}},{"$error":"#N/A"},{"$error":"#N/A"},{"$error":"#N/A"},400.8057637723976,327.11060806412064,231.12583731608893,231.12583731608893,178.92873398748446,178.92873398748446,null,null,10000,10000,10000,10000,10000,10000,10000,2.215173092665168,39.105495835317811,67.433267844666148,86.460004776283114,6,283.19646464920265,8.0073267040863289E-2,7.8790229630682496E-2,7.752344710240712E-2,7.6272713521912644E-2,7.5037825564067018E-2,7.3818582479677056E-2,7.261478606285382E-2,7.1002060412646437E-2,null,"Qmin",{"$f":"VLOOKUP(CF80,$BT$65:$BU$77,2,0)","v":{"$error":"#N/A"}},{"$f":"VLOOKUP(CG80,$BT$65:$BU$77,2,0)","v":{"$error":"#N/A"}},{"$error":"#N/A"},{"$error":"#N/A"},{"$error":"#N/A"},400.8057637723976,327.11060806412064,231.12583731608893,231.12583731608893,{"$f":"VLOOKUP(CO80,$BT$65:$BU$77,2,0)","v":178.92873398748446},178.92873398748446,null,283.19646464920265,6,283.19646464920265,null,null,null,null,null,null,null,null,null,null,null,null,null,10000,10000,10000,10000,10000,10000,10000,2.215173092665168,39.105495835317811,67.433267844666148,86.460004776283114,6,283.19646464920265,0.82,0.63,0.56000000000000005,0.56000000000000005,0.47,0.46,0.43,0.4,null,"Qmin",{"$f":"VLOOKUP(EE80,$DS$65:$DT$77,2,0)","v":{"$error":"#N/A"}},{"$error":"#N/A"},{"$error":"#N/A"},{"$error":"#N/A"},{"$error":"#N/A"},400.8057637723976,327.11060806412064,231.12583731608893,231.12583731608893,178.92873398748446,178.92873398748446]
[null,null,null,null,null,null,null,327.15697974421488,null,301.5271702711658,7,301.5271702711658,null,null,null,null,null,null,null,null,null,null,null,null,10000,10000,10000,10000,10000,10000,10000,20.545878714628316,57.436201457280958,85.763973466629295,104.79071039824626,7,301.5271702711658,7.6025434162581895E-2,7.2982049517947442E-2,7.0248173836320038E-2,6.779233038722772E-2,6.5586243590018481E-2,6.3604513460347664E-2,6.182432316510942E-2,5.9690197484964201E-2,null,"Qmax",{"$f":"VLOOKUP(AV81,$AJ$65:$AK$77,2,0)","v":87.760873700257221},87.760873700257221,87.760873700257221,87.760873700257221,87.760873700257221,432.99311881688482,346.2244862518063,283.19646464920265,283.19646464920265,231.12583731608893,231.12583731608893,null,null,10000,10000,10000,10000,10000,10000,10000,20.545878714628316,57.436201457280958,85.763973466629295,104.79071039824626,7,301.5271702711658,8.4922567212112193E-2,8.3578093712085522E-2,8.2250653431662962E-2,8.0940030575910565E-2,7.9646012083814097E-2,7.8368387593642688E-2,7.7106949408751527E-2,7.5417001101467512E-2,null,"Qmax",{"$f":"VLOOKUP(CF81,$BT$65:$BU$77,2,0)","v":87.760873700257221},87.760873700257221,87.760873700257221,87.760873700257221,87.760873700257221,432.99311881688482,346.2244862518063,283.19646464920265,283.19646464920265,231.12583731608893,231.12583731608893,null,301.5271702711658,7,301.5271702711658,null,null,null,null,null,null,null,null,null,null,null,null,null,10000,10000,10000,10000,10000,10000,10000,20.545878714628316,57.436201457280958,85.763973466629295,104.79071039824626,7,301.5271702711658,0.88,0.7,0.59,0.53,0.49,0.48,0.47,0.41,null,"Qmax",{"$f":"VLOOKUP(EE81,$DS$65:$DT$77,2,0)","v":87.760873700257221},{"$f":"VLOOKUP(EF81,$DS$65:$DT$77,2,0)","v":87.760873700257221},87.760873700257221,87.760873700257221,87.760873700257221,432.99311881688482,346.2244862518063,283.19646464920265,283.19646464920265,231.12583731608893,231.12583731608893]
[null,null,null,null,null,null,null,354.91500974957086,null,327.11060806412064,8,327.11060806412064,null,null,null,null,null,null,null,null,null,null,null,null,10000,10000,10000,10000,10000,10000,10000,46.129316507583155,83.019639250235798,111.34741125958413,130.3741481912011,8,327.11060806412064,8.1287572383794915E-2,7.7709033910702108E-2,7.4494428972544005E-2,7.1606745918098763E-2,6.9012737141484343E-2,6.6682536282773638E-2,6.4589314358897615E-2,6.2079920462112581E-2,null,null,null,null,null,null,null,null,null,null,null,null,null,null,null,10000,10000,10000,10000,10000,10000,10000,46.129316507583155,83.019639250235798,111.34741125958413,130.3741481912011,8,327.11060806412064,9.2090664405737169E-2,9.0655377830078987E-2,8.9238274990610114E-2,8.7839125516429403E-2,8.6457701955219263E-2,8.5093779736269762E-2,8.3747137133971555E-2,8.1943040497665279E-2,null,null,null,null,null,null,null,null,null,null,null,null,null,null,327.11060806412064,8,327.11060806412064,null,null,null,null,null,null,null,null,null,null,null,null,null,10000,10000,10000,10000,10000,10000,10000,46.129316507583155,83.019639250235798,111.34741125958413,130.3741481912011,8,327.11060806412064,0.96,0.77,0.65,0.6,0.53,0.51,0.48,0.47]
[null,null,null,null,null,null,null,375.65356758320979,null,346.2244862518063,9,346.2244862518063,null,null,null,null,null,null,null,null,null,null,null,null,10000,10000,10000,10000,10000,10000,15.2168519849061,65.243194695268812,102.13351743792145,130.46128944726979,149.48802637888676,9,346.2244862518063,8.5820304552208931E-2,8.1780792066019237E-2,7.8152093678815981E-2,7.4892430036158988E-2,7.1964270699265406E-2,6.9333902034832237E-2,6.6971039050001638E-2,6.4138394366969761E-2,null,"Lmin Q min",{"$f":"INDEX($AL$65:$AS$77,AV80,AV78)","v":6.6971039050001638E-2},{"$f":"INDEX($AL$65:$AS$77,AW80,AW78)","v":6.6971039050001638E-2},6.6971039050001638E-2,6.6971039050001638E-2,6.6971039050001638E-2,7.5618186529678583E-2,6.4589314358897615E-2,5.6182343555825909E-2,5.6182343555825909E-2,5.3363100179021856E-2,5.3363100179021856E-2,null,null,10000,10000,10000,10000,10000,10000,15.2168519849061,65.243194695268812,102.13351743792145,130.46128944726979,149.48802637888676,9,346.2244862518063,9.7767427988578098E-2,9.6260222136902107E-2,9.4772111171261192E-2,9.3302853177339315E-2,9.1852209305648233E-2,9.041994373269889E-2,8.9005823622664904E-2,8.7111327392194099E-2,null,"Lmin Q min",{"$f":"INDEX($BV$65:$CC$77,CF80,CF78)","v":8.9005823622664904E-2},{"$f":"INDEX($BV$65:$CC$77,CG80,CG78)","v":8.9005823622664904E-2},8.9005823622664904E-2,8.9005823622664904E-2,8.9005823622664904E-2,0.10555088946570576,8.3747137133971555E-2,6.0968016292154731E-2,6.0968016292154731E-2,5.0782550686995331E-2,5.0782550686995331E-2,null,346.2244862518063,9,346.2244862518063,null,null,null,null,null,null,null,null,null,null,null,null,null,10000,10000,10000,10000,10000,10000,15.2168519849061,65.243194695268812,102.13351743792145,130.46128944726979,149.48802637888676,9,346.2244862518063,0.99,0.8,0.73,0.63,0.57999999999999996,0.55000000000000004,0.53,0.49,null,"Lmin Q min",{"$f":"INDEX($DU$65:$EB$77,EE80,EE78)","v":0.53},{"$f":"INDEX($DU$65:$EB$77,EF80,EF78)","v":0.53},0.53,0.53,0.53,0.63,0.48,0.33,0.33,0.18,0.18]
[null,null,null,null,null,null,null,396.90445539851572,null,365.81055797098225,10,365.81055797098225,null,null,null,null,null,null,null,null,null,null,null,null,10000,10000,10000,10000,10000,10000,34.802923704082048,84.82926641444476,121.7195891570974,150.04736116644574,169.07409809806271,10,365.81055797098225,9.107688840979869E-2,8.6502786967989936E-2,8.2393866750131717E-2,7.8702819323328718E-2,7.5387147471707716E-2,7.2408675900792668E-2,6.973311170272159E-2,6.6525594911256078E-2,null,"Lmax Q min",{"$f":"INDEX($AL$65:$AS$77,AV80,AV79)","v":6.6525594911256078E-2},{"$f":"INDEX($AL$65:$AS$77,AW80,AW79)","v":6.6525594911256078E-2},6.6525594911256078E-2,6.6525594911256078E-2,6.6525594911256078E-2,7.1611939695214899E-2,6.2079920462112581E-2,5.481395471818877E-2,5.481395471818877E-2,5.2377342735171334E-2,5.2377342735171334E-2,null,null,10000,10000,10000,10000,10000,10000,34.802923704082048,84.82926641444476,121.7195891570974,150.04736116644574,169.07409809806271,10,365.81055797098225,0.10388585449922633,0.10230113391603253,0.10073649025789835,9.9191669168993413E-2,9.7666419515937394E-2,9.6160493346974629E-2,9.4673645851665891E-2,9.2681716767877037E-2,null,"Lmax Q min",{"$f":"INDEX($BV$65:$CC$77,CF80,CF79)","v":9.2681716767877037E-2},{"$f":"INDEX($BV$65:$CC$77,CG80,CG79)","v":9.2681716767877037E-2},9.2681716767877037E-2,9.2681716767877037E-2,9.2681716767877037E-2,0.10337197482754852,8.1943040497665279E-2,5.9555504756795746E-2,5.9555504756795746E-2,4.9545132677189366E-2,4.9545132677189366E-2,null,365.81055797098225,10,365.81055797098225,null,null,null,null,null,null,null,null,null,null,null,null,null,10000,10000,10000,10000,10000,10000,34.802923704082048,84.82926641444476,121.7195891570974,150.04736116644574,169.07409809806271,10,365.81055797098225,1.04,0.86,0.79,0.67,0.62,0.6,0.57999999999999996,0.52,null,"Lmax Q min",{"$f":"INDEX($DU$65:$EB$77,EE80,EE79)","v":0.52},{"$f":"INDEX($DU$65:$EB$77,EF80,EF79)","v":0.52},0.52,0.52,0.52,0.56000000000000005,0.47,0.31,0.31,0.18,0.18]
[null,null,null,null,null,null,null,434.8742536930514,null,400.8057637723976,11,400.8057637723976,null,null,null,null,null,null,null,null,null,null,null,null,10000,10000,10000,10000,10000,10000,69.7981295054974,119.82447221586011,156.71479495851275,185.04256696786109,204.06930389947806,11,400.8057637723976,0.10227695199452241,9.6563816066280089E-2,9.1431699950891898E-2,8.6821514554877646E-2,8.2680180082359472E-2,7.8960014895923594E-2,7.5618186529678583E-2,7.1611939695214899E-2,null,"Lmin Q max",{"$f":"INDEX($AL$65:$AS$77,AV81,AV78)","v":5.0196033213319238E-2},{"$f":"INDEX($AL$65:$AS$77,AW81,AW78)","v":5.0196033213319238E-2},5.0196033213319238E-2,5.0196033213319238E-2,5.0196033213319238E-2,8.232788570682642E-2,6.6971039050001638E-2,6.0103326940084398E-2,6.0103326940084398E-2,5.6182343555825909E-2,5.6182343555825909E-2,null,null,10000,10000,10000,10000,10000,10000,69.7981295054974,119.82447221586011,156.71479495851275,185.04256696786109,204.06930389947806,11,400.8057637723976,0.11562786280541335,0.11389438197810287,0.11218286272877107,0.11049302682480078,0.1088245995585215,0.10717730970255146,0.10555088946570576,0.10337197482754852,null,"Lmin Q max",{"$f":"INDEX($BV$65:$CC$77,CF81,CF78)","v":3.5928256330231154E-2},{"$f":"INDEX($BV$65:$CC$77,CG81,CG78)","v":3.5928256330231154E-2},3.5928256330231154E-2,3.5928256330231154E-2,3.5928256330231154E-2,0.11647163146426037,8.9005823622664904E-2,7.261478606285382E-2,7.261478606285382E-2,6.0968016292154731E-2,6.0968016292154731E-2,null,400.8057637723976,11,400.8057637723976,null,null,null,null,null,null,null,null,null,null,null,null,null,10000,10000,10000,10000,10000,10000,69.7981295054974,119.82447221586011,156.71479495851275,185.04256696786109,204.06930389947806,11,400.8057637723976,1.1599999999999999,0.94,0.83,0.75,0.71,0.65,0.63,0.56000000000000005,null,"Lmin Q max",{"$f":"INDEX($DU$65:$EB$77,EE81,EE78)","v":1.0000000000000001E-5},{"$f":"INDEX($DU$26:$EB$38,EF81,EF78)","v":1.0000000000000001E-5},1.0000000000000001E-5,1.0000000000000001E-5,1.0000000000000001E-5,0.72,0.53,0.43,0.43,0.33,0.33]
[null,null,null,null,null,null,null,469.79753391631999,null,432.99311881688482,12,432.99311881688482,null,null,null,null,null,null,null,null,null,null,null,null,10000,10000,10000,10000,10000,30.287080015637969,101.98548454998462,152.01182726034733,188.90215000299997,217.22992201234831,236.25665894396528,12,432.99311881688482,0.11504638307706339,0.10803460966653131,0.1017359261117164,9.6077811937047841E-2,9.0995121921748925E-2,8.642933604431341E-2,8.232788570682642E-2,7.7410989735376426E-2,null,"Lmax Q max",{"$f":"INDEX($AL$65:$AS$77,AV81,AV79)","v":4.9640114235091376E-2},{"$f":"INDEX($AL$65:$AS$77,AW81,AW79)","v":4.9640114235091376E-2},4.9640114235091376E-2,4.9640114235091376E-2,4.9640114235091376E-2,{"$f":"INDEX($AL$65:$AS$77,BA81,BA79)","v":7.7410989735376426E-2},6.4138394366969761E-2,5.8202777115681475E-2,5.8202777115681475E-2,5.481395471818877E-2,5.481395471818877E-2,null,null,10000,10000,10000,10000,10000,30.287080015637969,101.98548454998462,152.01182726034733,188.90215000299997,217.22992201234831,236.25665894396528,12,432.99311881688482,0.12741682771296009,0.12553399174538751,0.12367500954548943,0.12183957890837807,0.12002740145781846,0.11823818259772295,0.11647163146426037,0.1141049835115639,null,"Lmax Q max",{"$f":"INDEX($BV$65:$CC$77,CF81,CF79)","v":3.494619147455201E-2},{"$f":"INDEX($BV$65:$CC$77,CG81,CG79)","v":3.494619147455201E-2},3.494619147455201E-2,3.494619147455201E-2,3.494619147455201E-2,0.1141049835115639,8.7111327392194099E-2,7.1002060412646437E-2,7.1002060412646437E-2,5.9555504756795746E-2,5.9555504756795746E-2,null,432.99311881688482,12,432.99311881688482,null,null,null,null,null,null,null,null,null,null,null,null,null,10000,10000,10000,10000,10000,30.287080015637969,101.98548454998462,152.01182726034733,188.90215000299997,217.22992201234831,236.25665894396528,12,432.99311881688482,1.26,1.02,0.93,0.84,0.75,0.72,0.72,0.63,null,"Lmax Q max",{"$f":"INDEX($DU$65:$EB$77,EE81,EE79)","v":1.0000000000000001E-5},{"$f":"INDEX($DU$26:$EB$38,EF81,EF79)","v":1.0000000000000001E-5},1.0000000000000001E-5,1.0000000000000001E-5,1.0000000000000001E-5,0.63,0.49,0.4,0.4,0.31,0.31]
[null,null,null,null,null,null,null,502.30846537287511,null,462.95711094274202,13,462.95711094274202,null,null,null,null,null,null,null,null,null,null,null,null,{"$f":"IF($AK77-AV$66<=0,10000,$AK77-AV$66)","v":10000},10000,10000,10000,10000,60.251072141495172,131.94947667584182,181.97581938620453,218.86614212885718,247.19391413820551,266.22065106982245,13,462.95711094274202,0.12954997078087949,0.12106319801461227,0.11343952096080942,0.10659116370872247,0.10043927706383673,9.491303071037864E-2,8.9948797699925309E-2,8.3997581597820226E-2,null,"Index",null,null,null,null,null,null,null,null,null,null,null,null,null,10000,10000,10000,10000,10000,60.251072141495172,131.94947667584182,181.97581938620453,218.86614212885718,247.19391413820551,{"$f":"IF($BU77-CP$66<=0,10000,$BU77-CP$66)","v":266.22065106982245},13,462.95711094274202,0.13931839033371474,0.13728477271834683,0.13527691913286322,0.13329450317114364,0.13133720256232764,0.1294046991184245,0.12749667868258735,0.12494050435361337,null,"Index",null,null,null,null,null,null,null,null,null,null,null,null,462.95711094274202,13,462.95711094274202,null,null,null,null,null,null,null,null,null,null,null,null,null,10000,10000,10000,10000,10000,60.251072141495172,131.94947667584182,181.97581938620453,218.86614212885718,247.19391413820551,{"$f":"IF($DT77-EO$66<=0,10000,$DT77-EO$66)","v":266.22065106982245},13,462.95711094274202,1.36,1.08,0.97,0.88,0.82,0.77,0.76,0.69,null,"Index"]
[null,null,null,null,null,null,null,null,null,"Qmax","index",null,null,null,null,null,null,null,null,null,null,null,null,null,"Qmax","Qmax","Qmax","Qmax","Qmax","Qmax","Qmax","Qmax","Qmax","Qmax","Qmax","index",null,null,null,null,null,null,null,null,null,null,"L1min",{"$f":"AV79-1","v":7},{"$f":"AW79-1","v":7},7,7,7,7,7,7,7,7,7,null,null,"Qmax","Qmax","Qmax","Qmax","Qmax","Qmax","Qmax","Qmax","Qmax","Qmax","Qmax","index",null,null,null,null,null,null,null,null,null,null,"L2min",{"$f":"CF79-1","v":7},{"$f":"CG79-1","v":7},7,7,7,7,7,7,7,7,7,null,"Qmax","index",null,null,null,null,null,null,null,null,null,null,null,null,null,null,"Qmax","Qmax","Qmax","Qmax","Qmax","Qmax","Qmax","Qmax","Qmax","Qmax","Qmax","index",null,null,null,null,null,null,null,null,null,null,"L3min",{"$f":"EE79-1","v":7},{"$f":"EF79-1","v":7},7,7,7,7,7,7,7,7,7]
[null,null,null,null,null,null,null,null,null,{"$f":"MIN(J65:J77)","v":87.760873700257221},null,null,null,null,null,null,null,null,null,null,null,null,null,null,{"$f":"MIN(Y65:Y77)","v":10000},{"$f":"MIN(Z65:Z77)","v":10000},10000,10000,10000,30.287080015637969,15.2168519849061,2.215173092665168,39.105495835317811,15.362640511552428,34.389377443169394,null,null,null,null,null,null,null,null,null,null,null,"L1max",{"$f":"HLOOKUP(AU62,AL62:AS63,2,0)","v":8},{"$f":"HLOOKUP($ED$23,$DU$23:$EB$24,2,0)","v":8},8,8,8,8,8,8,8,8,8,null,null,{"$f":"MIN(BI65:BI77)","v":10000},{"$f":"MIN(BJ65:BJ77)","v":10000},10000,10000,10000,30.287080015637969,15.2168519849061,2.215173092665168,39.105495835317811,15.362640511552428,34.389377443169394,null,null,null,null,null,null,null,null,null,null,null,"L2max",{"$f":"HLOOKUP(CE62,BV62:CC63,2,0)","v":8},{"$f":"HLOOKUP($ED$23,$DU$23:$EB$24,2,0)","v":8},8,8,8,8,8,8,8,8,8,null,{"$f":"MIN(CR65:CR77)","v":87.760873700257221},null,null,null,null,null,null,null,null,null,null,null,null,null,null,null,{"$f":"MIN(DH65:DH77)","v":10000},{"$f":"MIN(DI65:DI77)","v":10000},10000,10000,10000,30.287080015637969,15.2168519849061,2.215173092665168,39.105495835317811,15.362640511552428,34.389377443169394,null,null,null,null,null,null,null,null,null,null,null,"L3max",{"$f":"HLOOKUP($ED$23,$DU$23:$EB$24,2,0)","v":8},{"$f":"HLOOKUP($ED$23,$DU$23:$EB$24,2,0)","v":8},8,8,8,8,8,8,8,8,8]
[null,null,null,null,null,null,null,null,null,null,null,null,null,null,null,null,null,null,null,null,null,null,null,null,null,null,null,null,null,null,null,null,null,null,null,null,null,null,null,null,null,null,null,null,null,null,"Qmin",{"$f":"AV81-1","v":0},{"$f":"AW81-1","v":0},0,0,0,11,8,5,5,4,4,null,null,null,null,null,null,null,null,null,null,null,null,null,null,null,null,null,null,null,null,null,null,null,null,"Qmin",{"$f":"CF81-1","v":0},{"$f":"CG81-1","v":0},0,0,0,11,8,5,5,4,4,null,null,null,null,null,null,null,null,null,null,null,null,null,null,null,null,null,null,null,null,null,null,null,null,null,null,null,null,null,null,null,null,null,null,null,null,null,null,null,"Qmin",{"$f":"EE81-1","v":0},{"$f":"EF81-1","v":0},0,0,0,11,8,5,5,{"$f":"EN81-1","v":4},{"$f":"EO81-1","v":4}]
[null,null,null,null,null,null,null,null,null,null,null,null,null,null,null,null,null,null,null,null,null,null,null,null,null,null,null,null,null,null,null,null,null,null,null,null,null,null,null,null,null,null,null,null,null,null,"Qmax",{"$f":"VLOOKUP(Y79,Y65:$AJ$77,12,0)","v":1},{"$f":"VLOOKUP(Z79,Z65:$AJ$77,11,0)","v":1},{"$f":"VLOOKUP(AA79,AA65:$AJ$77,10,0)","v":1},{"$f":"VLOOKUP(AB79,AB65:$AJ$77,9,0)","v":1},{"$f":"VLOOKUP(AC79,AC65:$AJ$77,8,0)","v":1},{"$f":"VLOOKUP(AD79,AD65:$AJ$77,7,0)","v":12},{"$f":"VLOOKUP(AE79,AE65:$AJ$77,6,0)","v":9},{"$f":"VLOOKUP(AF79,AF65:$AJ$77,5,0)","v":6},{"$f":"VLOOKUP(AG79,AG65:$AJ$77,4,0)","v":6},{"$f":"VLOOKUP(AH79,AH65:$AJ$77,3,0)","v":5},{"$f":"VLOOKUP(AI79,AI65:$AJ$77,2,0)","v":5},null,null,null,null,null,null,null,null,null,null,null,null,null,null,null,null,null,null,null,null,null,null,null,null,"Qmax",{"$f":"VLOOKUP(BI79,BI65:BT77,12,0)","v":1},{"$f":"VLOOKUP(BJ79,BJ65:BT77,11,0)","v":1},{"$f":"VLOOKUP(BK79,BK65:BU77,10,0)","v":1},{"$f":"VLOOKUP(BL79,BL65:BV77,9,0)","v":1},{"$f":"VLOOKUP(BM79,BM65:BW77,8,0)","v":1},{"$f":"VLOOKUP(BN79,BN65:BX77,7,0)","v":12},{"$f":"VLOOKUP(BO79,BO65:BY77,6,0)","v":9},{"$f":"VLOOKUP(BP79,BP65:BZ77,5,0)","v":6},{"$f":"VLOOKUP(BQ79,BQ65:CA77,4,0)","v":6},{"$f":"VLOOKUP(BR79,BR65:CB77,3,0)","v":5},{"$f":"VLOOKUP(BS79,BS65:CC77,2,0)","v":5},null,null,null,null,null,null,null,null,null,null,null,null,null,null,null,null,null,null,null,null,null,null,null,null,null,null,null,null,null,null,null,null,null,null,null,null,null,null,null,"Qmax",{"$f":"VLOOKUP(DH79,DH65:$DS$77,12,0)","v":1},{"$f":"VLOOKUP(DI79,DI65:$DS$77,11,0)","v":1},{"$f":"VLOOKUP(DJ79,DJ65:$DS$77,10,0)","v":1},{"$f":"VLOOKUP(DK79,DK65:$DS$77,9,0)","v":1},{"$f":"VLOOKUP(DL79,DL65:$DS$77,8,0)","v":1},{"$f":"VLOOKUP(DM79,DM65:$DS$77,7,0)","v":12},{"$f":"VLOOKUP(DN79,DN65:$DS$77,6,0)","v":9},{"$f":"VLOOKUP(DO79,DO65:$DS$77,5,0)","v":6},{"$f":"VLOOKUP(DP79,DP65:$DS$77,4,0)","v":6},{"$f":"VLOOKUP(DQ79,DQ65:$DS$77,3,0)","v":5},{"$f":"VLOOKUP(DR79,DR65:$DS$77,2,0)","v":5}]
[]
[null,null,null,null,null,null,null,null,null,null,null,null,null,null,null,null,null,null,null,null,null,null,null,null,null,null,null,null,null,null,null,null,null,null,null,null,null,null,null,null,null,null,null,null,null,null,"interp Qmin",{"$f":"FORECAST(AV65,AV73:AV74,AV68:AV69)","v":6.664350659504166E-2},{"$f":"FORECAST(AW65,AW73:AW74,AW68:AW69)","v":6.664350659504166E-2},{"$f":"FORECAST(AX65,AX73:AX74,AX68:AX69)","v":6.664350659504166E-2},6.664350659504166E-2,6.664350659504166E-2,7.2672416798455292E-2,6.2744171787732145E-2,5.5176175292857427E-2,{"$f":"FORECAST(BD65,BD73:BD74,BD68:BD69)","v":5.5176175292857427E-2},{"$f":"FORECAST(BE65,BE73:BE74,BE68:BE69)","v":5.2638278529131763E-2},{"$f":"FORECAST(BF65,BF73:BF74,BF68:BF69)","v":5.2638278529131763E-2},null,null,null,null,null,null,null,null,null,null,null,null,null,null,null,null,null,null,null,null,null,null,null,null,"interp Qmin",{"$f":"FORECAST(CF65,CF73:CF74,CF68:CF69)","v":9.1708686229438535E-2},9.1708686229438535E-2,9.1708686229438535E-2,9.1708686229438535E-2,9.1708686229438535E-2,0.10394874634941367,8.2420595489628712E-2,5.9929404869096654E-2,5.9929404869096654E-2,4.9872684503314474E-2,4.9872684503314474E-2,null,null,null,null,null,null,null,null,null,null,null,null,null,null,null,null,null,null,null,null,null,null,null,null,null,null,null,null,null,null,null,null,null,null,null,null,null,null,null,"interp Qmin",{"$f":"FORECAST(EE65,EE73:EE74,EE68:EE69)","v":0.52264705882352946},{"$f":"FORECAST(EF65,EF73:EF74,EF68:EF69)","v":0.52264705882352946},{"$f":"FORECAST(EG65,EG73:EG74,EG68:EG69)","v":0.52264705882352946},0.52264705882352946,0.52264705882352946,0.57852941176470574,0.47264705882352942,0.31529411764705884,{"$f":"FORECAST(EM65,EM73:EM74,EM68:EM69)","v":0.31529411764705884},{"$f":"FORECAST(EN65,EN73:EN74,EN68:EN69)","v":0.18},{"$f":"FORECAST(EO65,EO73:EO74,EO68:EO69)","v":0.18}]
[null,null,null,null,null,null,null,null,null,null,null,null,null,null,null,null,null,null,null,null,null,null,null,null,null,null,null,null,null,null,null,null,null,null,null,null,null,null,null,null,null,null,null,null,null,null,"interp Qmax",{"$f":"FORECAST(AV65,AV75:AV76,AV68:AV69)","v":4.9787269258739927E-2},{"$f":"FORECAST(AW65,AW75:AW76,AW68:AW69)","v":4.9787269258739927E-2},4.9787269258739927E-2,4.9787269258739927E-2,4.9787269258739927E-2,7.871252102193671E-2,6.4888212077184079E-2,5.8705863833905775E-2,5.8705863833905775E-2,5.5176175292857427E-2,5.5176175292857427E-2,null,null,null,null,null,null,null,null,null,null,null,null,null,null,null,null,null,null,null,null,null,null,null,null,"interp Qmax",{"$f":"FORECAST(CF65,CF75:CF76,CF68:CF69)","v":3.5206149818702369E-2},{"$f":"FORECAST(CG65,CG75:CG76,CG68:CG69)","v":3.5206149818702369E-2},3.5206149818702369E-2,3.5206149818702369E-2,3.5206149818702369E-2,0.11473144914610121,8.761281168849519E-2,7.1428958378877805E-2,7.1428958378877805E-2,5.9929404869096654E-2,5.9929404869096654E-2,null,null,null,null,null,null,null,null,null,null,null,null,null,null,null,null,null,null,null,null,null,null,null,null,null,null,null,null,null,null,null,null,null,null,null,null,null,null,null,"interp Qmax",{"$f":"FORECAST(EE65,EE75:EE76,EE68:EE69)","v":1.0000000000000001E-5},{"$f":"FORECAST(EF65,EF75:EF76,EF68:EF69)","v":1.0000000000000001E-5},1.0000000000000001E-5,1.0000000000000001E-5,1.0000000000000001E-5,0.65382352941176491,0.50058823529411767,0.40794117647058825,0.40794117647058825,0.31529411764705884,0.31529411764705884]
[]
[]
["C nozzle","C nozzle","C nozzle","C nozzle","C nozzle","C nozzle","C nozzle","C nozzle","C nozzle","C nozzle","C nozzle","C nozzle","C nozzle","C nozzle","C nozzle","C nozzle","C nozzle","C nozzle","C nozzle","C nozzle","C nozzle","C nozzle","C nozzle","C nozzle","C nozzle","C nozzle","C nozzle","C nozzle","C nozzle","C nozzle","C nozzle","C nozzle","C nozzle","C nozzle","C nozzle","C nozzle","C nozzle","C nozzle","C nozzle","C nozzle","C nozzle","C nozzle","C nozzle","C nozzle","C nozzle","C nozzle","C nozzle","C nozzle","C nozzle","C nozzle","C nozzle","C nozzle","C nozzle","C nozzle","C nozzle","C nozzle","C nozzle","C nozzle","C nozzle","C nozzle","C nozzle","C nozzle","C nozzle","C nozzle","C nozzle","C nozzle","C nozzle","C nozzle","C nozzle","C nozzle","C nozzle","C nozzle","C nozzle","C nozzle","C nozzle","C nozzle","C nozzle","C nozzle","C nozzle","C nozzle","C nozzle","C nozzle","C nozzle","C nozzle","C nozzle","C nozzle","C nozzle","C nozzle","C nozzle","C nozzle","C nozzle","C nozzle","C nozzle","C nozzle","C nozzle","C nozzle","C nozzle","C nozzle","C nozzle","C nozzle","C nozzle","C nozzle","C nozzle","C nozzle","C nozzle","C nozzle","C nozzle","C nozzle","C nozzle","C nozzle","C nozzle","C nozzle","C nozzle","C nozzle","C nozzle","C nozzle","C nozzle","C nozzle","C nozzle","C nozzle","C nozzle","C nozzle","C nozzle","C nozzle","C nozzle","C nozzle","C nozzle","C nozzle","C nozzle","C nozzle","C nozzle","C nozzle","C nozzle","C nozzle","C nozzle","C nozzle","C nozzle","C nozzle","C nozzle","C nozzle","C nozzle","C nozzle","C nozzle","C nozzle","C nozzle"]
[]
[null,null,null,null,null,null,null,null,null,null,null,"V1 (h=2m)",null,null,null,null,null,null,null,null,null,null,null,null,null,null,null,null,null,null,null,null,null,null,null,null,"v1 (h=1,8m)",null,null,null,null,null,null,null,null,null,null,null,null,null,null,null,null,null,null,null,null,null,null,null,null,null,null,null,null,null,null,null,null,null,null,null,"v2 ",null,null,null,null,null,null,null,null,null,null,null,null,null,null,null,null,null,null,null,null,null,null,null,null,"V3 (h =2)",null,null,null,null,null,null,null,null,null,null,null,null,null,null,null,null,null,null,null,null,null,null,null,null,null,"V3 (h =1,8)"]
[]
[null,null,null,null,null,null,null,null,null,null,null,null,0.5,1,1.5,2,2.5,3,3.5,4.18,"x [m]",null,null,null,null,null,null,null,null,null,null,null,null,null,null,null,null,0.5,1,1.5,2,2.5,3,3.5,4.18,"x [m]",null,null,null,null,null,null,null,null,null,null,null,null,null,null,null,null,null,null,null,null,null,null,null,null,null,null,null,0.5,1,1.5,2,2.5,3,3.5,4.18,"x [m]",null,null,null,null,null,null,null,null,null,null,null,null,null,null,null,null,0.5,1,1.5,2,2.5,3,3.5,4.18,"x [m]",null,null,null,null,null,null,null,null,null,null,null,null,null,null,null,null,null,0.5,1,1.5,2,2.5,3,3.5,4.18,"x [m]"]
[]
[null,null,null,null,null,null,null,null,null,null,null,null,{"$f":"IF(M95-$W$26<=0,10000,(M95-$W$26))","v":1.2000000000000002},{"$f":"IF(N95-$W$26<=0,10000,(N95-$W$26))","v":1.7000000000000002},2.2000000000000002,2.7,3.2,3.7,4.2,4.88,"L3max",{"$f":"MIN(M93:T93)","v":1.2000000000000002},null,null,null,null,null,null,null,null,null,null,null,null,null,null,null,{"$f":"IF(AL95-$AV$26<=0,10000,(AL95-$AV$26))","v":10000},{"$f":"IF(AM95-$AV$26<=0,10000,(AM95-$AV$26))","v":10000},10000,10000,10000,10000,10000,0.17999999999999972,"L3max",{"$f":"MIN(AL93:AS93)","v":0.17999999999999972},null,null,null,null,null,null,null,null,null,null,null,null,null,null,null,null,null,null,null,null,null,null,null,null,null,null,{"$f":"IF(BV95-$CF$26<=0,10000,(BV95-$CF$26))","v":10000},{"$f":"IF(BW95-$CF$26<=0,10000,(BW95-$CF$26))","v":10000},10000,10000,10000,10000,10000,0.17999999999999972,"L3max",{"$f":"MIN(BV93:CC93)","v":0.17999999999999972},null,null,null,null,null,null,null,null,null,null,null,null,null,null,null,{"$f":"IF(CU95-$DE$26<=0,10000,(CU95-$DE$26))","v":1.2000000000000002},{"$f":"IF(CV95-$DE$26<=0,10000,(CV95-$DE$26))","v":1.7000000000000002},2.2000000000000002,2.7,3.2,3.7,4.2,4.88,"L3max",{"$f":"MIN(CU93:DB93)","v":1.2000000000000002},null,null,null,null,null,null,null,null,null,null,null,null,null,null,null,null,{"$f":"IF(DU95-$EE$26<=0,10000,(DU95-$EE$26))","v":10000},{"$f":"IF(DV95-$EE$26<=0,10000,(DV95-$EE$26))","v":10000},10000,10000,10000,10000,10000,0.17999999999999972,"L3max",{"$f":"MIN(DU93:EB93)","v":0.17999999999999972}]
[null,null,null,null,null,null,null,null,null,null,null,"2 sides",1,2,3,4,5,6,7,8,"index",null,null,null,null,null,null,null,null,null,null,null,null,null,null,null,"2 sides",1,2,3,4,5,6,7,8,"index",null,null,null,null,null,null,null,null,null,null,null,null,null,null,null,null,null,null,null,null,null,null,null,null,null,null,null,1,2,3,4,5,6,7,8,"index",null,"beam",null,null,null,null,null,null,null,null,null,null,null,null,null,"2 sides",1,2,3,4,5,6,7,8,"index",null,null,null,null,null,null,null,null,null,null,null,null,null,null,null,null,"2 sides",1,2,3,4,5,6,7,8,"index",null,"beam"]
[null,null,null,null,null,null,null,"Qt [m³/h]",null,null,null,"Qt [m³/h/m]",{"$f":"M91+(2.7-2)","v":1.2000000000000002},{"$f":"N91+(2.7-2)","v":1.7000000000000002},2.2000000000000002,2.7,3.2,3.7,4.2,4.88,"L1  h 2m [m]",null,null,null,600,900,1000,1100,1200,1500,1800,2100,2400,2700,3000,null,"Q [m³/h/m]",{"$f":"AL91+(2.7-1.8)","v":1.4000000000000001},1.9000000000000001,2.4000000000000004,2.9000000000000004,3.4000000000000004,3.9000000000000004,4.4000000000000004,5.08,"L1  h=1,8m [m]",null,600,900,1000,1100,1200,1500,1800,2100,2400,2700,3000,null,null,600,900,1000,1100,1200,1500,1800,2100,2400,2700,3000,null,"Q [m³/h/m]",{"$f":"BV91+2.6+0.5","v":3.6},4.0999999999999996,4.5999999999999996,5.0999999999999996,5.6,6.1,6.6,7.2799999999999994,"L2   [m]",null,600,900,1000,1100,1200,1500,1800,2100,2400,2700,3000,null,null,null,"Q [m³/h/m]",{"$f":"CU91+(2.7-2)","v":1.2000000000000002},{"$f":"CV91+(2.7-2)","v":1.7000000000000002},{"$f":"CW91+(2.7-2)","v":2.2000000000000002},2.7,3.2,3.7,4.2,4.88,"L3  h 2 [m]",null,null,null,null,600,900,1000,1100,1200,1500,1800,2100,2400,2700,3000,null,"Q [m³/h/m]",{"$f":"DU91+(2.7-1.8)","v":1.4000000000000001},1.9000000000000001,2.4000000000000004,2.9000000000000004,3.4000000000000004,3.9000000000000004,4.4000000000000004,5.08,"L3  h 1,8m [m]",null,600,900,1000,1100,1200,1500,1800,2100,2400,2700,3000]
[null,null,null,null,null,null,null,{"$f":"H65","v":95.220547964779087},null,{"$f":"IF(L96-$W$27<=0,10000,L96-$W$27)","v":87.760873700257221},1,{"$f":"H96/$J$21","v":87.760873700257221},null,null,null,null,null,null,null,null,null,null,null,null,{"$f":"IF($AK96-AV$97<=0,10000,$AK96-AV$97)","v":10000},{"$f":"IF($AK96-AW$97<=0,10000,$AK96-AW$97)","v":10000},10000,10000,10000,10000,10000,10000,10000,10000,10000,1,{"$f":"L96","v":87.760873700257221},5.3895284475259042E-2,5.3102512382340677E-2,5.2390364363284515E-2,5.1750641036018202E-2,5.1175976886855684E-2,5.0659755466974259E-2,5.0196033213319238E-2,4.9640114235091376E-2,null,"L1 @ 1,8m",{"$f":"$R$1","v":4.9000000000000004},4.9000000000000004,4.9000000000000004,4.9000000000000004,4.9000000000000004,4.9000000000000004,4.9000000000000004,4.9000000000000004,4.9000000000000004,4.9000000000000004,4.9000000000000004,null,null,{"$f":"IF($BU96-CF$97<=0,10000,$BU96-CF$97)","v":10000},{"$f":"IF($BU96-CG$97<=0,10000,$BU96-CG$97)","v":10000},10000,10000,10000,10000,10000,10000,10000,10000,10000,1,{"$f":"AK96","v":87.760873700257221},4.0470077838627563E-2,3.9688775731292619E-2,3.8917371989653352E-2,3.8155741210690153E-2,3.7403759580122292E-2,3.6661304852279863E-2,3.5928256330231154E-2,3.494619147455201E-2,null,"L2",{"$f":"$R$3","v":7.1},7.1,7.1,7.1,7.1,7.1,7.1,7.1,7.1,7.1,7.1,null,{"$f":"IF(CT96-$DE$27<=0,10000,CT96-$DE$27)","v":87.760873700257221},1,{"$f":"BU96","v":87.760873700257221},null,null,null,null,null,null,null,null,null,null,null,null,null,{"$f":"IF($DT96-EE$97<=0,10000,$DT96-EE$97)","v":10000},{"$f":"IF($DT96-EF$97<=0,10000,$DT96-EF$97)","v":10000},10000,10000,10000,10000,10000,10000,10000,10000,10000,1,{"$f":"CT96","v":87.760873700257221},0.12,0.05,1.0000000000000001E-5,1.0000000000000001E-5,1.0000000000000001E-5,1.0000000000000001E-5,1.0000000000000001E-5,1.0000000000000001E-5,null,"L3",{"$f":"$R$4","v":4.9000000000000004},4.9000000000000004,4.9000000000000004,4.9000000000000004,4.9000000000000004,4.9000000000000004,4.9000000000000004,4.9000000000000004,4.9000000000000004,4.9000000000000004,4.9000000000000004]
[null,null,null,null,null,null,null,{"$f":"H66","v":125.64109874496727},null,{"$f":"IF(L97-$W$27<=0,10000,L97-$W$27)","v":115.79824769121407},2,{"$f":"H97/$J$21","v":115.79824769121407},null,null,null,null,null,null,null,null,null,null,null,null,{"$f":"IF($AK97-AV$97<=0,10000,$AK97-AV$97)","v":10000},10000,10000,10000,10000,10000,10000,10000,10000,10000,10000,2,{"$f":"L97","v":115.79824769121407},5.5364704737271481E-2,5.4422494175469849E-2,5.3576105419969183E-2,5.2815793495564353E-2,5.2132804480604873E-2,5.15192747179085E-2,5.0968140275817066E-2,5.0307429918488432E-2,null,"Q1",{"$f":"B7","v":943.07641740212705},{"$f":"C7","v":582.66504769430776},516.82718919777585,464.35742379698644,421.55950455302457,330.24697649099755,271.44929521663596,230.42421281613682,200.1715809365565,176.94083653386136,161.33758816226864,null,null,{"$f":"IF($BU97-CF$97<=0,10000,$BU97-CF$97)","v":10000},10000,10000,10000,10000,10000,10000,10000,10000,10000,10000,2,{"$f":"AK97","v":115.79824769121407},4.4920708561285494E-2,4.4083021132503716E-2,4.3255946418612759E-2,4.2439349966458026E-2,4.1633099026280443E-2,4.083706253013597E-2,4.0051111070588674E-2,3.899817216753497E-2,null,"Q2",{"$f":"B7","v":943.07641740212705},{"$f":"C7","v":582.66504769430776},516.82718919777585,464.35742379698644,421.55950455302457,330.24697649099755,271.44929521663596,230.42421281613682,200.1715809365565,176.94083653386136,161.33758816226864,null,{"$f":"IF(CT97-$DE$27<=0,10000,CT97-$DE$27)","v":115.79824769121407},2,{"$f":"BU97","v":115.79824769121407},null,null,null,null,null,null,null,null,null,null,null,null,null,{"$f":"IF($DT97-EE$97<=0,10000,$DT97-EE$97)","v":10000},10000,10000,10000,10000,10000,10000,10000,10000,10000,10000,2,{"$f":"CT97","v":115.79824769121407},0.23,0.16,7.0000000000000007E-2,0.05,0.04,0.03,0.02,0.01,null,"Q3",{"$f":"B7","v":943.07641740212705},{"$f":"C7","v":582.66504769430776},516.82718919777585,464.35742379698644,421.55950455302457,330.24697649099755,271.44929521663596,230.42421281613682,200.1715809365565,176.94083653386136,161.33758816226864]
[null,null,null,null,null,null,null,137.17143957099856,null,126.42528992718762,3,126.42528992718762,null,null,null,null,null,null,null,null,null,null,null,null,10000,10000,10000,10000,10000,10000,10000,10000,10000,10000,10000,3,{"$f":"L98","v":126.42528992718762},5.6055635508297855E-2,5.5043158026135998E-2,5.4133648420914837E-2,5.3316634969688949E-2,5.2582710912535406E-2,5.19234261469535E-2,5.1331189936828218E-2,5.0621206005267073E-2,null,"v1",{"$f":"FORECAST(AV97,AV114:AV115,AV101:AV102)","v":{"$error":"#N/A"}},{"$f":"FORECAST(AW97,AW114:AW115,AW101:AW102)","v":{"$error":"#N/A"}},{"$error":"#N/A"},{"$error":"#N/A"},7.6566951070340838E-2,6.3095984235408062E-2,5.7909563665086497E-2,5.5142061320352688E-2,5.3671135701012895E-2,5.25690233770508E-2,5.2025431283322689E-2,null,null,10000,10000,10000,10000,10000,10000,10000,10000,10000,10000,10000,3,{"$f":"AK98","v":126.42528992718762},4.6867855120326762E-2,4.6005499168929376E-2,4.5154068459492325E-2,4.4313424579435864E-2,4.3483430869737966E-2,4.2663952402718336E-2,4.185485596010402E-2,4.0770909731107002E-2,null,"v2",{"$f":"FORECAST(CF97,CF114:CF115,CF101:CF102)","v":{"$error":"#N/A"}},{"$f":"FORECAST(CG97,CG114:CG115,CG101:CG102)","v":{"$error":"#N/A"}},{"$error":"#N/A"},{"$error":"#N/A"},0.11090121008704293,8.3272578681722886E-2,6.8834651177351935E-2,5.9794224160822876E-2,5.3965504945763305E-2,{"$f":"FORECAST(CO97,CO114:CO115,CO101:CO102)","v":4.953893471094481E-2},{"$f":"FORECAST(CP97,CP114:CP115,CP101:CP102)","v":4.6919292085607051E-2},null,126.42528992718762,3,{"$f":"BU98","v":126.42528992718762},null,null,null,null,null,null,null,null,null,null,null,null,null,10000,10000,10000,10000,10000,10000,10000,10000,10000,10000,10000,3,{"$f":"CT98","v":126.42528992718762},0.33,0.21,0.13,0.1,0.06,0.06,0.06,0.16,null,"v3",{"$f":"FORECAST(EE97,EE114:EE115,EE101:EE102)","v":{"$error":"#N/A"}},{"$f":"FORECAST(EF97,EF114:EF115,EF101:EF102)","v":{"$error":"#N/A"}},{"$error":"#N/A"},{"$error":"#N/A"},0.62707750146618413,0.47723188576611242,0.38703993611359233,0.31347551734958667,0.23506114422083679,0.17824051991874632,0.16443014722440297]
[null,null,null,null,null,null,null,194.13767637642064,null,178.92873398748446,4,178.92873398748446,null,null,null,null,null,null,null,null,null,null,null,null,10000,10000,10000,10000,10000,10000,10000,10000,10000,1.9878974536231055,17.591145825215818,4,178.92873398748446,5.9922625237430555E-2,5.8516879036136234E-2,5.7254095719859018E-2,5.6119736116112734E-2,5.5100739670701233E-2,5.4185374073819917E-2,5.3363100179021856E-2,5.2377342735171334E-2,null,"L1min",{"$f":"HLOOKUP(AV109,$AL$24:$AS$25,2,0)","v":4.4000000000000004},{"$f":"HLOOKUP(AW109,$AL$24:$AS$25,2,0)","v":4.4000000000000004},4.4000000000000004,4.4000000000000004,4.4000000000000004,4.4000000000000004,4.4000000000000004,4.4000000000000004,4.4000000000000004,4.4000000000000004,4.4000000000000004,null,null,10000,10000,10000,10000,10000,10000,10000,10000,10000,1.9878974536231055,17.591145825215818,4,178.92873398748446,5.6505321132667499E-2,5.5520867516264505E-2,5.4548886004843811E-2,5.3589218588520407E-2,5.2641709259246577E-2,5.1706203985450297E-2,5.0782550686995331E-2,4.9545132677189366E-2,null,"L2min",{"$f":"HLOOKUP(CF109,$BV$24:$CC$25,2,0)","v":6.6},{"$f":"HLOOKUP(CG109,$BV$24:$CC$25,2,0)","v":6.6},6.6,6.6,6.6,6.6,6.6,6.6,6.6,6.6,6.6,null,178.92873398748446,4,178.92873398748446,null,null,null,null,null,null,null,null,null,null,null,null,null,10000,10000,10000,10000,10000,10000,10000,10000,10000,1.9878974536231055,17.591145825215818,4,178.92873398748446,0.49,0.39,0.31,0.28000000000000003,0.22,0.19,0.18,0.18,null,"L3min",{"$f":"HLOOKUP(EE109,$DU$24:$EB$25,2,0)","v":4.4000000000000004},{"$f":"HLOOKUP(EF109,$DU$24:$EB$25,2,0)","v":4.4000000000000004},4.4000000000000004,4.4000000000000004,4.4000000000000004,4.4000000000000004,4.4000000000000004,4.4000000000000004,4.4000000000000004,4.4000000000000004,4.4000000000000004]
[null,null,null,null,null,null,null,250.77153348795648,null,231.12583731608893,5,231.12583731608893,null,null,null,null,null,null,null,null,null,null,null,null,10000,10000,10000,10000,10000,10000,10000,0.70162449995211773,30.954256379532438,54.185000782227576,69.788249153820288,5,231.12583731608893,6.5288012426117065E-2,6.333661208681246E-2,6.1583667074702406E-2,6.0008994695288684E-2,5.8594464812515165E-2,5.7323791105769732E-2,5.6182343555825909E-2,5.481395471818877E-2,null,"L1max",{"$f":"HLOOKUP(AV110,$AL$24:$AS$25,2,0)","v":5.08},5.08,5.08,5.08,5.08,5.08,5.08,5.08,5.08,5.08,5.08,null,null,10000,10000,10000,10000,10000,10000,10000,0.70162449995211773,30.954256379532438,54.185000782227576,69.788249153820288,5,231.12583731608893,6.7500553563040924E-2,6.6376800653211263E-2,6.5267284639901696E-2,6.417182515497187E-2,6.3090244115376864E-2,6.2022365694216985E-2,6.0968016292154731E-2,5.9555504756795746E-2,null,"L2max",{"$f":"HLOOKUP(CF110,$BV$24:$CC$25,2,0)","v":7.2799999999999994},7.2799999999999994,7.2799999999999994,7.2799999999999994,7.2799999999999994,7.2799999999999994,7.2799999999999994,7.2799999999999994,7.2799999999999994,7.2799999999999994,7.2799999999999994,null,231.12583731608893,5,231.12583731608893,null,null,null,null,null,null,null,null,null,null,null,null,null,10000,10000,10000,10000,10000,10000,10000,0.70162449995211773,30.954256379532438,54.185000782227576,69.788249153820288,5,231.12583731608893,0.65,0.53,0.42,0.42,0.37,0.36,0.33,0.31,null,"L3max",{"$f":"HLOOKUP(EE110,$DU$24:$EB$25,2,0)","v":5.08},5.08,5.08,5.08,5.08,5.08,5.08,5.08,5.08,5.08,5.08]
[null,null,null,null,null,null,null,307.26816414438485,null,283.19646464920265,6,283.19646464920265,null,null,null,null,null,null,null,null,null,null,null,null,10000,10000,10000,10000,10000,10000,11.747169432566693,52.772251833065837,83.024883712646158,106.2556281153413,121.85887648693401,6,283.19646464920265,7.2750154286605126E-2,7.0039862101958825E-2,6.760520373343068E-2,6.5418147516752817E-2,6.3453512577929388E-2,6.1688678910915187E-2,6.0103326940084398E-2,5.8202777115681475E-2,null,"Qmin",{"$f":"VLOOKUP(AV111,$AJ$96:$AK$108,2,0)","v":{"$error":"#N/A"}},{"$f":"VLOOKUP(AW111,$AJ$96:$AK$108,2,0)","v":{"$error":"#N/A"}},{"$error":"#N/A"},{"$error":"#N/A"},400.8057637723976,327.11060806412064,231.12583731608893,178.92873398748446,178.92873398748446,126.42528992718762,126.42528992718762,null,null,10000,10000,10000,10000,10000,10000,11.747169432566693,52.772251833065837,83.024883712646158,106.2556281153413,121.85887648693401,6,283.19646464920265,8.0073267040863289E-2,7.8790229630682496E-2,7.752344710240712E-2,7.6272713521912644E-2,7.5037825564067018E-2,7.3818582479677056E-2,7.261478606285382E-2,7.1002060412646437E-2,null,"Qmin",{"$f":"VLOOKUP(CF111,$BT$96:$BU$108,2,0)","v":{"$error":"#N/A"}},{"$f":"VLOOKUP(CG111,$BT$96:$BU$108,2,0)","v":{"$error":"#N/A"}},{"$error":"#N/A"},{"$error":"#N/A"},400.8057637723976,327.11060806412064,231.12583731608893,178.92873398748446,178.92873398748446,126.42528992718762,126.42528992718762,null,283.19646464920265,6,283.19646464920265,null,null,null,null,null,null,null,null,null,null,null,null,null,10000,10000,10000,10000,10000,10000,11.747169432566693,52.772251833065837,83.024883712646158,106.2556281153413,121.85887648693401,6,283.19646464920265,0.82,0.63,0.56000000000000005,0.56000000000000005,0.47,0.46,0.43,0.4,null,"Qmin",{"$f":"VLOOKUP(EE111,$DS$65:$DT$77,2,0)","v":{"$error":"#N/A"}},{"$f":"VLOOKUP(EF111,$DS$65:$DT$77,2,0)","v":{"$error":"#N/A"}},{"$error":"#N/A"},{"$error":"#N/A"},400.8057637723976,327.11060806412064,231.12583731608893,178.92873398748446,178.92873398748446,126.42528992718762,126.42528992718762]
[null,null,null,null,null,null,null,327.15697974421488,null,301.5271702711658,7,301.5271702711658,null,null,null,null,null,null,null,null,null,null,null,null,10000,10000,10000,10000,10000,10000,30.077875054529841,71.102957455028985,101.35558933460931,124.58633373730444,140.18958210889716,7,301.5271702711658,7.6025434162581895E-2,7.2982049517947442E-2,7.0248173836320038E-2,6.779233038722772E-2,6.5586243590018481E-2,6.3604513460347664E-2,6.182432316510942E-2,5.9690197484964201E-2,null,"Qmax",{"$f":"VLOOKUP(AV112,$AJ$96:$AK$108,2,0)","v":87.760873700257221},87.760873700257221,87.760873700257221,87.760873700257221,432.99311881688482,346.2244862518063,283.19646464920265,231.12583731608893,231.12583731608893,178.92873398748446,178.92873398748446,null,null,10000,10000,10000,10000,10000,10000,30.077875054529841,71.102957455028985,{"$f":"IF($BU102-CN$97<=0,10000,$BU102-CN$97)","v":101.35558933460931},124.58633373730444,140.18958210889716,7,301.5271702711658,8.4922567212112193E-2,8.3578093712085522E-2,8.2250653431662962E-2,8.0940030575910565E-2,7.9646012083814097E-2,7.8368387593642688E-2,7.7106949408751527E-2,7.5417001101467512E-2,null,"Qmax",{"$f":"VLOOKUP(CF112,$BT$96:$BU$108,2,0)","v":87.760873700257221},87.760873700257221,87.760873700257221,87.760873700257221,432.99311881688482,346.2244862518063,283.19646464920265,231.12583731608893,231.12583731608893,178.92873398748446,178.92873398748446,null,301.5271702711658,7,301.5271702711658,null,null,null,null,null,null,null,null,null,null,null,null,null,10000,10000,10000,10000,10000,10000,30.077875054529841,71.102957455028985,{"$f":"IF($DT102-EM$97<=0,10000,$DT102-EM$97)","v":101.35558933460931},124.58633373730444,140.18958210889716,7,301.5271702711658,0.88,0.7,0.59,0.53,0.49,0.48,0.47,0.41,null,"Qmax",{"$f":"VLOOKUP(EE112,$DS$65:$DT$77,2,0)","v":87.760873700257221},87.760873700257221,87.760873700257221,87.760873700257221,432.99311881688482,346.2244862518063,283.19646464920265,231.12583731608893,{"$f":"VLOOKUP(EM112,$DS$65:$DT$77,2,0)","v":231.12583731608893},178.92873398748446,178.92873398748446]
[null,null,null,null,null,null,null,354.91500974957086,null,327.11060806412064,8,327.11060806412064,null,null,null,null,null,null,null,null,null,null,null,null,10000,10000,10000,10000,10000,10000,55.66131284748468,96.686395247983825,126.93902712756415,150.16977153025928,165.773019901852,8,327.11060806412064,8.1287572383794915E-2,7.7709033910702108E-2,7.4494428972544005E-2,7.1606745918098763E-2,6.9012737141484343E-2,6.6682536282773638E-2,6.4589314358897615E-2,6.2079920462112581E-2,null,null,null,null,null,null,null,null,null,null,null,null,null,null,null,10000,10000,10000,10000,10000,10000,55.66131284748468,96.686395247983825,126.93902712756415,150.16977153025928,165.773019901852,8,327.11060806412064,9.2090664405737169E-2,9.0655377830078987E-2,8.9238274990610114E-2,8.7839125516429403E-2,8.6457701955219263E-2,8.5093779736269762E-2,8.3747137133971555E-2,8.1943040497665279E-2,null,null,null,null,null,null,null,null,null,null,null,null,null,null,327.11060806412064,8,327.11060806412064,null,null,null,null,null,null,null,null,null,null,null,null,null,10000,10000,10000,10000,10000,10000,55.66131284748468,96.686395247983825,{"$f":"IF($DT103-EM$97<=0,10000,$DT103-EM$97)","v":126.93902712756415},150.16977153025928,165.773019901852,8,327.11060806412064,0.96,0.77,0.65,0.6,0.53,0.51,0.48,0.47]
[null,null,null,null,null,null,null,375.65356758320979,null,346.2244862518063,9,346.2244862518063,null,null,null,null,null,null,null,null,null,null,null,null,10000,10000,10000,10000,10000,15.977509760808744,74.775191035170337,115.80027343566948,146.0529053152498,169.28364971794494,184.88689808953765,9,346.2244862518063,8.5820304552208931E-2,8.1780792066019237E-2,7.8152093678815981E-2,7.4892430036158988E-2,7.1964270699265406E-2,6.9333902034832237E-2,6.6971039050001638E-2,6.4138394366969761E-2,null,"Lmin Q min",{"$f":"INDEX($AL$96:$AS$108,AV111,AV109)","v":6.6971039050001638E-2},{"$f":"INDEX($AL$96:$AS$108,AW111,AW109)","v":6.6971039050001638E-2},6.6971039050001638E-2,6.6971039050001638E-2,7.5618186529678583E-2,6.4589314358897615E-2,5.6182343555825909E-2,5.3363100179021856E-2,5.3363100179021856E-2,5.1331189936828218E-2,5.1331189936828218E-2,null,null,10000,10000,10000,10000,10000,15.977509760808744,74.775191035170337,115.80027343566948,146.0529053152498,169.28364971794494,184.88689808953765,9,346.2244862518063,9.7767427988578098E-2,9.6260222136902107E-2,9.4772111171261192E-2,9.3302853177339315E-2,9.1852209305648233E-2,9.041994373269889E-2,8.9005823622664904E-2,8.7111327392194099E-2,null,"Lmin Q min",{"$f":"INDEX($BV$96:$CC$108,CF111,CF109)","v":8.9005823622664904E-2},{"$f":"INDEX($BV$96:$CC$108,CG111,CG109)","v":8.9005823622664904E-2},8.9005823622664904E-2,8.9005823622664904E-2,0.10555088946570576,8.3747137133971555E-2,6.0968016292154731E-2,5.0782550686995331E-2,5.0782550686995331E-2,4.185485596010402E-2,4.185485596010402E-2,null,346.2244862518063,9,346.2244862518063,null,null,null,null,null,null,null,null,null,null,null,null,null,10000,10000,10000,10000,10000,15.977509760808744,74.775191035170337,115.80027343566948,146.0529053152498,169.28364971794494,184.88689808953765,9,346.2244862518063,0.99,0.8,0.73,0.63,0.57999999999999996,0.55000000000000004,0.53,0.49,null,"Lmin Q min",{"$f":"INDEX($DU$96:$EB$108,EE111,EE109)","v":0.53},{"$f":"INDEX($DU$96:$EB$108,EF111,EF109)","v":0.53},0.53,0.53,0.63,0.48,0.33,0.18,0.18,0.06,0.06]
[null,null,null,null,null,null,null,396.90445539851572,null,365.81055797098225,10,365.81055797098225,null,null,null,null,null,null,null,null,null,null,null,null,10000,10000,10000,10000,10000,35.563581479984691,94.361262754346285,135.38634515484543,165.63897703442575,188.86972143712089,204.4729698087136,10,365.81055797098225,9.107688840979869E-2,8.6502786967989936E-2,8.2393866750131717E-2,7.8702819323328718E-2,7.5387147471707716E-2,7.2408675900792668E-2,6.973311170272159E-2,6.6525594911256078E-2,null,"Lmax Q min",{"$f":"INDEX($AL$96:$AS$108,AV111,AV110)","v":6.6525594911256078E-2},{"$f":"INDEX($AL$96:$AS$108,AW111,AW110)","v":6.6525594911256078E-2},6.6525594911256078E-2,6.6525594911256078E-2,7.1611939695214899E-2,6.2079920462112581E-2,5.481395471818877E-2,5.2377342735171334E-2,5.2377342735171334E-2,5.0621206005267073E-2,5.0621206005267073E-2,null,null,10000,10000,10000,10000,10000,35.563581479984691,94.361262754346285,135.38634515484543,165.63897703442575,188.86972143712089,204.4729698087136,10,365.81055797098225,0.10388585449922633,0.10230113391603253,0.10073649025789835,9.9191669168993413E-2,9.7666419515937394E-2,9.6160493346974629E-2,9.4673645851665891E-2,9.2681716767877037E-2,null,"Lmax Q min",{"$f":"INDEX($BV$96:$CC$108,CF111,CF110)","v":9.2681716767877037E-2},{"$f":"INDEX($BV$96:$CC$108,CG111,CG110)","v":9.2681716767877037E-2},9.2681716767877037E-2,9.2681716767877037E-2,0.10337197482754852,8.1943040497665279E-2,5.9555504756795746E-2,4.9545132677189366E-2,4.9545132677189366E-2,4.0770909731107002E-2,4.0770909731107002E-2,null,365.81055797098225,10,365.81055797098225,null,null,null,null,null,null,null,null,null,null,null,null,null,10000,10000,10000,10000,10000,35.563581479984691,94.361262754346285,135.38634515484543,165.63897703442575,188.86972143712089,204.4729698087136,10,365.81055797098225,1.04,0.86,0.79,0.67,0.62,0.6,0.57999999999999996,0.52,null,"Lmax Q min",{"$f":"INDEX($DU$96:$EB$108,EE111,EE110)","v":0.52},{"$f":"INDEX($DU$96:$EB$108,EF111,EF110)","v":0.52},0.52,0.52,0.56000000000000005,0.47,0.31,0.18,0.18,0.16,0.16]
[null,null,null,null,null,null,null,434.8742536930514,null,400.8057637723976,11,400.8057637723976,null,null,null,null,null,null,null,null,null,null,null,null,10000,10000,10000,10000,10000,70.558787281400043,129.35646855576164,170.38155095626078,200.6341828358411,223.86492723853624,239.46817561012895,11,400.8057637723976,0.10227695199452241,9.6563816066280089E-2,9.1431699950891898E-2,8.6821514554877646E-2,8.2680180082359472E-2,7.8960014895923594E-2,7.5618186529678583E-2,7.1611939695214899E-2,null,"Lmin Q max",{"$f":"INDEX($AL$96:$AS$108,AV112,AV109)","v":5.0196033213319238E-2},{"$f":"INDEX($AL$96:$AS$108,AW112,AW109)","v":5.0196033213319238E-2},5.0196033213319238E-2,5.0196033213319238E-2,8.232788570682642E-2,6.6971039050001638E-2,6.0103326940084398E-2,5.6182343555825909E-2,5.6182343555825909E-2,5.3363100179021856E-2,5.3363100179021856E-2,null,null,10000,10000,10000,10000,10000,70.558787281400043,129.35646855576164,170.38155095626078,200.6341828358411,223.86492723853624,239.46817561012895,11,400.8057637723976,0.11562786280541335,0.11389438197810287,0.11218286272877107,0.11049302682480078,0.1088245995585215,0.10717730970255146,0.10555088946570576,0.10337197482754852,null,"Lmin Q max",{"$f":"INDEX($BV$96:$CC$108,CF112,CF109)","v":3.5928256330231154E-2},{"$f":"INDEX($BV$96:$CC$108,CG112,CG109)","v":3.5928256330231154E-2},3.5928256330231154E-2,3.5928256330231154E-2,0.11647163146426037,8.9005823622664904E-2,7.261478606285382E-2,6.0968016292154731E-2,6.0968016292154731E-2,5.0782550686995331E-2,5.0782550686995331E-2,null,400.8057637723976,11,400.8057637723976,null,null,null,null,null,null,null,null,null,null,null,null,null,10000,10000,10000,10000,10000,70.558787281400043,129.35646855576164,170.38155095626078,200.6341828358411,223.86492723853624,239.46817561012895,11,400.8057637723976,1.1599999999999999,0.94,0.83,0.75,0.71,0.65,0.63,0.56000000000000005,null,"Lmin Q max",{"$f":"INDEX($DU$96:$EB$108,EE112,EE109)","v":1.0000000000000001E-5},{"$f":"INDEX($DU$96:$EB$108,EF112,EF109)","v":1.0000000000000001E-5},1.0000000000000001E-5,1.0000000000000001E-5,0.72,0.53,0.43,0.33,0.33,0.18,0.18]
[null,null,null,null,null,null,null,469.79753391631999,null,432.99311881688482,12,432.99311881688482,null,null,null,null,null,null,null,null,null,null,null,null,10000,10000,10000,10000,11.43361426386025,102.74614232588726,161.54382360024886,202.568906000748,232.82153788032832,256.05228228302349,271.6555306546162,12,432.99311881688482,0.11504638307706339,0.10803460966653131,0.1017359261117164,9.6077811937047841E-2,9.0995121921748925E-2,8.642933604431341E-2,8.232788570682642E-2,7.7410989735376426E-2,null,"Lmax Q max",{"$f":"INDEX($AL$96:$AS$108,AV112,AV110)","v":4.9640114235091376E-2},{"$f":"INDEX($AL$96:$AS$108,AW112,AW110)","v":4.9640114235091376E-2},4.9640114235091376E-2,4.9640114235091376E-2,7.7410989735376426E-2,6.4138394366969761E-2,5.8202777115681475E-2,5.481395471818877E-2,5.481395471818877E-2,5.2377342735171334E-2,5.2377342735171334E-2,null,null,10000,10000,10000,10000,11.43361426386025,102.74614232588726,161.54382360024886,202.568906000748,232.82153788032832,256.05228228302349,271.6555306546162,12,432.99311881688482,0.12741682771296009,0.12553399174538751,0.12367500954548943,0.12183957890837807,0.12002740145781846,0.11823818259772295,0.11647163146426037,0.1141049835115639,null,"Lmax Q max",{"$f":"INDEX($BV$96:$CC$108,CF112,CF110)","v":3.494619147455201E-2},{"$f":"INDEX($BV$96:$CC$108,CG112,CG110)","v":3.494619147455201E-2},3.494619147455201E-2,3.494619147455201E-2,0.1141049835115639,8.7111327392194099E-2,7.1002060412646437E-2,5.9555504756795746E-2,5.9555504756795746E-2,4.9545132677189366E-2,4.9545132677189366E-2,null,432.99311881688482,12,432.99311881688482,null,null,null,null,null,null,null,null,null,null,null,null,null,10000,10000,10000,10000,11.43361426386025,102.74614232588726,161.54382360024886,202.568906000748,232.82153788032832,256.05228228302349,271.6555306546162,12,432.99311881688482,1.26,1.02,0.93,0.84,0.75,0.72,0.72,0.63,null,"Lmax Q max",{"$f":"INDEX($DU$96:$EB$108,EE112,EE110)","v":1.0000000000000001E-5},{"$f":"INDEX($DU$96:$EB$108,EF112,EF110)","v":1.0000000000000001E-5},1.0000000000000001E-5,1.0000000000000001E-5,0.63,0.49,0.4,0.31,0.31,0.18,0.18]
[null,null,null,null,null,null,null,502.30846537287511,null,462.95711094274202,13,462.95711094274202,null,null,null,null,null,null,null,null,null,null,null,null,10000,10000,10000,10000,41.397606389717453,132.71013445174447,191.50781572610606,232.5328981266052,262.78553000618552,286.01627440888069,{"$f":"IF($AK108-BF$97<=0,10000,$AK108-BF$97)","v":301.6195227804734},13,462.95711094274202,0.12954997078087949,0.12106319801461227,0.11343952096080942,0.10659116370872247,0.10043927706383673,9.491303071037864E-2,8.9948797699925309E-2,8.3997581597820226E-2,null,"Index",null,null,null,null,null,null,null,null,null,null,null,null,null,10000,10000,10000,10000,41.397606389717453,132.71013445174447,191.50781572610606,232.5328981266052,262.78553000618552,286.01627440888069,301.6195227804734,13,462.95711094274202,0.13931839033371474,0.13728477271834683,0.13527691913286322,0.13329450317114364,0.13133720256232764,0.1294046991184245,0.12749667868258735,0.12494050435361337,null,"Index",null,null,null,null,null,null,null,null,null,null,null,null,462.95711094274202,13,462.95711094274202,null,null,null,null,null,null,null,null,null,null,null,null,null,10000,10000,10000,10000,41.397606389717453,132.71013445174447,191.50781572610606,232.5328981266052,262.78553000618552,286.01627440888069,301.6195227804734,13,462.95711094274202,1.36,1.08,0.97,0.88,0.82,0.77,0.76,0.69,null,"Index"]
[null,null,null,null,null,null,null,null,null,"Qmax","index",null,null,null,null,null,null,null,null,null,null,null,null,null,"Qmax","Qmax","Qmax","Qmax","Qmax","Qmax","Qmax","Qmax","Qmax","Qmax","Qmax","index",null,null,null,null,null,null,null,null,null,null,"L1min",{"$f":"AV110-1","v":7},{"$f":"AW110-1","v":7},7,7,7,7,7,7,7,7,7,null,null,"Qmax","Qmax","Qmax","Qmax","Qmax","Qmax","Qmax","Qmax","Qmax","Qmax","Qmax","index",null,null,null,null,null,null,null,null,null,null,"L2min",{"$f":"CF110-1","v":7},{"$f":"CG110-1","v":7},7,7,7,7,7,7,7,7,7,null,"Qmax","index",null,null,null,null,null,null,null,null,null,null,null,null,null,null,"Qmax","Qmax","Qmax","Qmax","Qmax","Qmax","Qmax","Qmax","Qmax","Qmax","Qmax","index",null,null,null,null,null,null,null,null,null,null,"L3min",{"$f":"EE110-1","v":7},{"$f":"EF110-1","v":7},7,7,7,7,7,7,7,7,7]
[null,null,null,null,null,null,null,null,null,{"$f":"MIN(J96:J108)","v":87.760873700257221},null,null,null,null,null,null,null,null,null,null,null,null,null,null,{"$f":"MIN(Y96:Y108)","v":10000},{"$f":"MIN(Z96:Z108)","v":10000},10000,10000,11.43361426386025,15.977509760808744,11.747169432566693,0.70162449995211773,30.954256379532438,1.9878974536231055,17.591145825215818,null,null,null,null,null,null,null,null,null,null,null,"L1max",{"$f":"HLOOKUP(AU93,AL93:AS94,2,0)","v":8},{"$f":"HLOOKUP($ED$23,$DU$23:$EB$24,2,0)","v":8},8,8,8,8,8,8,8,8,8,null,null,{"$f":"MIN(BI96:BI108)","v":10000},{"$f":"MIN(BJ96:BJ108)","v":10000},10000,10000,11.43361426386025,15.977509760808744,11.747169432566693,0.70162449995211773,30.954256379532438,1.9878974536231055,17.591145825215818,null,null,null,null,null,null,null,null,null,null,null,"L2max",{"$f":"HLOOKUP(CE93,BV93:CC94,2,0)","v":8},{"$f":"HLOOKUP($ED$23,$DU$23:$EB$24,2,0)","v":8},8,8,8,8,8,8,8,8,8,null,{"$f":"MIN(CR96:CR108)","v":87.760873700257221},null,null,null,null,null,null,null,null,null,null,null,null,null,null,null,{"$f":"MIN(DH96:DH108)","v":10000},{"$f":"MIN(DI96:DI108)","v":10000},10000,10000,11.43361426386025,15.977509760808744,11.747169432566693,0.70162449995211773,30.954256379532438,1.9878974536231055,17.591145825215818,null,null,null,null,null,null,null,null,null,null,null,"L3max",{"$f":"HLOOKUP($ED$23,$DU$23:$EB$24,2,0)","v":8},{"$f":"HLOOKUP($ED$23,$DU$23:$EB$24,2,0)","v":8},8,8,8,8,8,8,8,8,8]
[null,null,null,null,null,null,null,null,null,null,null,null,null,null,null,null,null,null,null,null,null,null,null,null,null,null,null,null,null,null,null,null,null,null,null,null,null,null,null,null,null,null,null,null,null,null,"Qmin",{"$f":"AV112-1","v":0},{"$f":"AW112-1","v":0},0,0,11,8,5,4,4,3,3,null,null,null,null,null,null,null,null,null,null,null,null,null,null,null,null,null,null,null,null,null,null,null,null,"Qmin",{"$f":"CF112-1","v":0},{"$f":"CG112-1","v":0},0,0,11,8,5,4,4,3,3,null,null,null,null,null,null,null,null,null,null,null,null,null,null,null,null,null,null,null,null,null,null,null,null,null,null,null,null,null,null,null,null,null,null,null,null,null,null,null,"Qmin",{"$f":"EE112-1","v":0},{"$f":"EF112-1","v":0},0,0,11,8,5,4,4,3,3]
[null,null,null,null,null,null,null,null,null,null,null,null,null,null,null,null,null,null,null,null,null,null,null,null,null,null,null,null,null,null,null,null,null,null,null,null,null,null,null,null,null,null,null,null,null,null,"Qmax",{"$f":"VLOOKUP(Y110,Y96:$AJ$108,12,0)","v":1},{"$f":"VLOOKUP(Z110,Z96:$AJ$108,11,0)","v":1},{"$f":"VLOOKUP(AA110,AA96:$AJ$108,10,0)","v":1},{"$f":"VLOOKUP(AB110,AB96:$AJ$108,9,0)","v":1},{"$f":"VLOOKUP(AC110,AC96:$AJ$108,8,0)","v":12},{"$f":"VLOOKUP(AD110,AD96:$AJ$108,7,0)","v":9},{"$f":"VLOOKUP(AE110,AE96:$AJ$108,6,0)","v":6},{"$f":"VLOOKUP(AF110,AF96:$AJ$108,5,0)","v":5},{"$f":"VLOOKUP(AG110,AG96:$AJ$108,4,0)","v":5},{"$f":"VLOOKUP(AH110,AH96:$AJ$108,3,0)","v":4},{"$f":"VLOOKUP(AI110,AI96:$AJ$108,2,0)","v":4},null,null,null,null,null,null,null,null,null,null,null,null,null,null,null,null,null,null,null,null,null,null,null,null,"Qmax",{"$f":"VLOOKUP(BI110,BI96:$BT$108,12,0)","v":1},{"$f":"VLOOKUP(BJ110,BJ96:$BT$108,11,0)","v":1},{"$f":"VLOOKUP(BK110,BK96:$BT$108,10,0)","v":1},{"$f":"VLOOKUP(BL110,BL96:$BT$108,9,0)","v":1},{"$f":"VLOOKUP(BM110,BM96:$BT$108,8,0)","v":12},{"$f":"VLOOKUP(BN110,BN96:$BT$108,7,0)","v":9},{"$f":"VLOOKUP(BO110,BO96:$BT$108,6,0)","v":6},{"$f":"VLOOKUP(BP110,BP96:$BT$108,5,0)","v":5},{"$f":"VLOOKUP(BQ110,BQ96:$BT$108,4,0)","v":5},{"$f":"VLOOKUP(BR110,BR96:$BT$108,3,0)","v":4},{"$f":"VLOOKUP(BS110,BS96:$BT$108,2,0)","v":4},null,null,null,null,null,null,null,null,null,null,null,null,null,null,null,null,null,null,null,null,null,null,null,null,null,null,null,null,null,null,null,null,null,null,null,null,null,null,null,"Qmax",{"$f":"VLOOKUP(DH110,DH96:$DS$108,12,0)","v":1},{"$f":"VLOOKUP(DI110,DI96:$DS$108,11,0)","v":1},{"$f":"VLOOKUP(DJ110,DJ96:$DS$108,10,0)","v":1},{"$f":"VLOOKUP(DK110,DK96:$DS$108,9,0)","v":1},{"$f":"VLOOKUP(DL110,DL96:$DS$108,8,0)","v":12},{"$f":"VLOOKUP(DM110,DM96:$DS$108,7,0)","v":9},{"$f":"VLOOKUP(DN110,DN96:$DS$108,6,0)","v":6},{"$f":"VLOOKUP(DO110,DO96:$DS$108,5,0)","v":5},{"$f":"VLOOKUP(DP110,DP96:$DS$108,4,0)","v":5},{"$f":"VLOOKUP(DQ110,DQ96:$DS$108,3,0)","v":4},{"$f":"VLOOKUP(DR110,DR96:$DS$108,2,0)","v":4}]
[]
[null,null,null,null,null,null,null,null,null,null,null,null,null,null,null,null,null,null,null,null,null,null,null,null,null,null,null,null,null,null,null,null,null,null,null,null,null,null,null,null,null,null,null,null,null,null,"interp Qmin",{"$f":"FORECAST(AV96,AV104:AV105,AV99:AV100)","v":6.664350659504166E-2},{"$f":"FORECAST(AW96,AW104:AW105,AW99:AW100)","v":6.664350659504166E-2},{"$f":"FORECAST(AX96,AX104:AX105,AX99:AX100)","v":6.664350659504166E-2},6.664350659504166E-2,7.2672416798455292E-2,6.2744171787732145E-2,5.5176175292857427E-2,5.2638278529131763E-2,{"$f":"FORECAST(BD96,BD104:BD105,BD99:BD100)","v":5.2638278529131763E-2},{"$f":"FORECAST(BE96,BE104:BE105,BE99:BE100)","v":5.0809142928327375E-2},{"$f":"FORECAST(BF96,BF104:BF105,BF99:BF100)","v":5.0809142928327375E-2},null,null,null,null,null,null,null,null,null,null,null,null,null,null,null,null,null,null,null,null,null,null,null,null,"interp Qmin",{"$f":"FORECAST(CF96,CF104:CF105,CF99:CF100)","v":9.1708686229438535E-2},9.1708686229438535E-2,9.1708686229438535E-2,9.1708686229438535E-2,0.10394874634941367,8.2420595489628712E-2,5.9929404869096654E-2,4.9872684503314474E-2,4.9872684503314474E-2,4.1057836674076802E-2,4.1057836674076802E-2,null,null,null,null,null,null,null,null,null,null,null,null,null,null,null,null,null,null,null,null,null,null,null,null,null,null,null,null,null,null,null,null,null,null,null,null,null,null,null,"interp Qmin",{"$f":"FORECAST(EE96,EE104:EE105,EE99:EE100)","v":0.52264705882352946},{"$f":"FORECAST(EF96,EF104:EF105,EF99:EF100)","v":0.52264705882352946},{"$f":"FORECAST(EG96,EG104:EG105,EG99:EG100)","v":0.52264705882352946},0.52264705882352946,0.57852941176470574,0.47264705882352942,0.31529411764705884,0.18,{"$f":"FORECAST(EM96,EM104:EM105,EM99:EM100)","v":0.18},{"$f":"FORECAST(EN96,EN104:EN105,EN99:EN100)","v":0.1335294117647059},{"$f":"FORECAST(EO96,EO104:EO105,EO99:EO100)","v":0.1335294117647059}]
[null,null,null,null,null,null,null,null,null,null,null,null,null,null,null,null,null,null,null,null,null,null,null,null,null,null,null,null,null,null,null,null,null,null,null,null,null,null,null,null,null,null,null,null,null,null,"interp Qmax",{"$f":"FORECAST(AV96,AV106:AV107,AV99:AV100)","v":4.9787269258739927E-2},{"$f":"FORECAST(AW96,AW106:AW107,AW99:AW100)","v":4.9787269258739927E-2},4.9787269258739927E-2,4.9787269258739927E-2,7.871252102193671E-2,6.4888212077184079E-2,5.8705863833905775E-2,5.5176175292857427E-2,5.5176175292857427E-2,5.2638278529131763E-2,5.2638278529131763E-2,null,null,null,null,null,null,null,null,null,null,null,null,null,null,null,null,null,null,null,null,null,null,null,null,"interp Qmax",{"$f":"FORECAST(CF96,CF106:CF107,CF99:CF100)","v":3.5206149818702369E-2},{"$f":"FORECAST(CG96,CG106:CG107,CG99:CG100)","v":3.5206149818702369E-2},3.5206149818702369E-2,3.5206149818702369E-2,0.11473144914610121,8.761281168849519E-2,7.1428958378877805E-2,5.9929404869096654E-2,5.9929404869096654E-2,4.9872684503314474E-2,4.9872684503314474E-2,null,null,null,null,null,null,null,null,null,null,null,null,null,null,null,null,null,null,null,null,null,null,null,null,null,null,null,null,null,null,null,null,null,null,null,null,null,null,null,"interp Qmax",{"$f":"FORECAST(EE96,EE106:EE107,EE99:EE100)","v":1.0000000000000001E-5},{"$f":"FORECAST(EF96,EF106:EF107,EF99:EF100)","v":1.0000000000000001E-5},1.0000000000000001E-5,1.0000000000000001E-5,0.65382352941176491,0.50058823529411767,0.40794117647058825,0.31529411764705884,0.31529411764705884,0.18,0.18]
[]
[]
["D nozzle","D nozzle","D nozzle","D nozzle","D nozzle","D nozzle","D nozzle","D nozzle","D nozzle","D nozzle","D nozzle","D nozzle","D nozzle","D nozzle","D nozzle","D nozzle","D nozzle","D nozzle","D nozzle","D nozzle","D nozzle","D nozzle","D nozzle","D nozzle","D nozzle","D nozzle","D nozzle","D nozzle","D nozzle","D nozzle","D nozzle","D nozzle","D nozzle","D nozzle","D nozzle","D nozzle","D nozzle","D nozzle","D nozzle","D nozzle","D nozzle","D nozzle","D nozzle","D nozzle","D nozzle","D nozzle","D nozzle","D nozzle","D nozzle","D nozzle","D nozzle","D nozzle","D nozzle","D nozzle","D nozzle","D nozzle","D nozzle","D nozzle","D nozzle","D nozzle","D nozzle","D nozzle","D nozzle","D nozzle","D nozzle","D nozzle","D nozzle","D nozzle","D nozzle","D nozzle","D nozzle","D nozzle","D nozzle","D nozzle","D nozzle","D nozzle","D nozzle","D nozzle","D nozzle","D nozzle","D nozzle","D nozzle","D nozzle","D nozzle","D nozzle","D nozzle","D nozzle","D nozzle","D nozzle","D nozzle","D nozzle","D nozzle","D nozzle","D nozzle","D nozzle","D nozzle","D nozzle","D nozzle","D nozzle","D nozzle","D nozzle","D nozzle","D nozzle","D nozzle","D nozzle","D nozzle","D nozzle","D nozzle","D nozzle","D nozzle","D nozzle","D nozzle","D nozzle","D nozzle","D nozzle","D nozzle","D nozzle","D nozzle","D nozzle","D nozzle","D nozzle","D nozzle","D nozzle","D nozzle","D nozzle","D nozzle","D nozzle","D nozzle","D nozzle","D nozzle","D nozzle","D nozzle","D nozzle","D nozzle","D nozzle","D nozzle","D nozzle","D nozzle","D nozzle","D nozzle","D nozzle","D nozzle","D nozzle","D nozzle","D nozzle"]
[]
[null,null,null,null,null,null,null,null,null,null,null,"V1 (h=2m)",null,null,null,null,null,null,null,null,null,null,null,null,null,null,null,null,null,null,null,null,null,null,null,null,"v1 (h=1,8m)",null,null,null,null,null,null,null,null,null,null,null,null,null,null,null,null,null,null,null,null,null,null,null,null,null,null,null,null,null,null,null,null,null,null,null,"v2 ",null,null,null,null,null,null,null,null,null,null,null,null,null,null,null,null,null,null,null,null,null,null,null,null,"V3 (h =2)",null,null,null,null,null,null,null,null,null,null,null,null,null,null,null,null,null,null,null,null,null,null,null,null,null,"V3 (h =1,8)"]
[]
[null,null,null,null,null,null,null,null,null,null,null,null,0.5,1,1.5,2,2.5,3,3.5,4.18,"x [m]",null,null,null,null,null,null,null,null,null,null,null,null,null,null,null,null,0.5,1,1.5,2,2.5,3,3.5,4.18,"x [m]",null,null,null,null,null,null,null,null,null,null,null,null,null,null,null,null,null,null,null,null,null,null,null,null,null,null,null,0.5,1,1.5,2,2.5,3,3.5,4.18,"x [m]",null,null,null,null,null,null,null,null,null,null,null,null,null,null,null,null,0.5,1,1.5,2,2.5,3,3.5,4.18,"x [m]",null,null,null,null,null,null,null,null,null,null,null,null,null,null,null,null,null,0.5,1,1.5,2,2.5,3,3.5,4.18,"x [m]"]
[]
[null,null,null,null,null,null,null,null,null,null,null,null,{"$f":"IF(M126-$W$26<=0,10000,(M126-$W$26))","v":1.2000000000000002},{"$f":"IF(N126-$W$26<=0,10000,(N126-$W$26))","v":1.7000000000000002},2.2000000000000002,2.7,3.2,3.7,4.2,4.88,"L3max",{"$f":"MIN(M124:T124)","v":1.2000000000000002},null,null,null,null,null,null,null,null,null,null,null,null,null,null,null,{"$f":"IF(AL126-$AV$26<=0,10000,(AL126-$AV$26))","v":10000},{"$f":"IF(AM126-$AV$26<=0,10000,(AM126-$AV$26))","v":10000},10000,10000,10000,10000,10000,0.17999999999999972,"L3max",{"$f":"MIN(AL124:AS124)","v":0.17999999999999972},null,null,null,null,null,null,null,null,null,null,null,null,null,null,null,null,null,null,null,null,null,null,null,null,null,null,{"$f":"IF(BV126-$CF$26<=0,10000,(BV126-$CF$26))","v":10000},{"$f":"IF(BW126-$CF$26<=0,10000,(BW126-$CF$26))","v":10000},10000,10000,10000,10000,10000,0.17999999999999972,"L3max",{"$f":"MIN(BV124:CC124)","v":0.17999999999999972},null,null,null,null,null,null,null,null,null,null,null,null,null,null,null,{"$f":"IF(CU126-$DE$26<=0,10000,(CU126-$DE$26))","v":1.2000000000000002},{"$f":"IF(CV126-$DE$26<=0,10000,(CV126-$DE$26))","v":1.7000000000000002},2.2000000000000002,2.7,3.2,3.7,4.2,4.88,"L3max",{"$f":"MIN(CU124:DB124)","v":1.2000000000000002},null,null,null,null,null,null,null,null,null,null,null,null,null,null,null,null,{"$f":"IF(DU126-$EE$26<=0,10000,(DU126-$EE$26))","v":10000},{"$f":"IF(DV126-$EE$26<=0,10000,(DV126-$EE$26))","v":10000},10000,10000,10000,10000,10000,0.17999999999999972,"L3max",{"$f":"MIN(DU124:EB124)","v":0.17999999999999972}]
[null,null,null,null,null,null,null,null,null,null,null,"2 sides",1,2,3,4,5,6,7,8,"index",null,null,null,null,null,null,null,null,null,null,null,null,null,null,null,"2 sides",1,2,3,4,5,6,7,8,"index",null,null,null,null,null,null,null,null,null,null,null,null,null,null,null,null,null,null,null,null,null,null,null,null,null,null,null,1,2,3,4,5,6,7,8,"index",null,"beam",null,null,null,null,null,null,null,null,null,null,null,null,null,"2 sides",1,2,3,4,5,6,7,8,"index",null,null,null,null,null,null,null,null,null,null,null,null,null,null,null,null,"2 sides",1,2,3,4,5,6,7,8,"index",null,"beam"]
[null,null,null,null,null,null,null,"Qt [m³/h]",null,null,null,"Qt [m³/h/m]",{"$f":"M122+(2.7-2)","v":1.2000000000000002},{"$f":"N122+(2.7-2)","v":1.7000000000000002},2.2000000000000002,2.7,3.2,3.7,4.2,4.88,"L1  h 2m [m]",null,null,null,600,900,1000,1100,1200,1500,1800,2100,2400,2700,3000,null,"Q [m³/h/m]",{"$f":"AL122+(2.7-1.8)","v":1.4000000000000001},1.9000000000000001,2.4000000000000004,2.9000000000000004,3.4000000000000004,3.9000000000000004,4.4000000000000004,5.08,"L1  h=1,8m [m]",null,600,900,1000,1100,1200,1500,1800,2100,2400,2700,3000,null,null,600,900,1000,1100,1200,1500,1800,2100,2400,2700,3000,null,"Q [m³/h/m]",{"$f":"BV122+2.6+0.5","v":3.6},4.0999999999999996,4.5999999999999996,5.0999999999999996,5.6,6.1,6.6,7.2799999999999994,"L2   [m]",null,600,900,1000,1100,1200,1500,1800,2100,2400,2700,3000,null,null,null,"Q [m³/h/m]",{"$f":"CU122+(2.7-2)","v":1.2000000000000002},{"$f":"CV122+(2.7-2)","v":1.7000000000000002},{"$f":"CW122+(2.7-2)","v":2.2000000000000002},2.7,3.2,3.7,4.2,4.88,"L3  h 2 [m]",null,null,null,null,600,900,1000,1100,1200,1500,1800,2100,2400,2700,3000,null,"Q [m³/h/m]",{"$f":"DU122+(2.7-1.8)","v":1.4000000000000001},1.9000000000000001,2.4000000000000004,2.9000000000000004,3.4000000000000004,3.9000000000000004,4.4000000000000004,5.08,"L3  h 1,8m [m]",null,600,900,1000,1100,1200,1500,1800,2100,2400,2700,3000]
[null,null,null,null,null,null,null,{"$f":"H96","v":95.220547964779087},null,{"$f":"IF(L127-$W$27<=0,10000,L127-$W$27)","v":87.760873700257221},1,{"$f":"H127/$J$21","v":87.760873700257221},null,null,null,null,null,null,null,null,null,null,null,null,{"$f":"IF($AK127-AV$128<=0,10000,$AK127-AV$128)","v":10000},{"$f":"IF($AK127-AW$128<=0,10000,$AK127-AW$128)","v":10000},10000,10000,10000,10000,10000,10000,10000,10000,10000,1,{"$f":"L127","v":87.760873700257221},5.3895284475259042E-2,5.3102512382340677E-2,5.2390364363284515E-2,5.1750641036018202E-2,5.1175976886855684E-2,5.0659755466974259E-2,5.0196033213319238E-2,4.9640114235091376E-2,null,"L1 @ 1,8m",{"$f":"$R$1","v":4.9000000000000004},4.9000000000000004,4.9000000000000004,4.9000000000000004,4.9000000000000004,4.9000000000000004,4.9000000000000004,4.9000000000000004,4.9000000000000004,4.9000000000000004,4.9000000000000004,null,null,{"$f":"IF($BU127-CF$128<=0,10000,$BU127-CF$128)","v":10000},{"$f":"IF($BU127-CG$128<=0,10000,$BU127-CG$128)","v":10000},10000,10000,10000,10000,10000,10000,10000,10000,10000,1,{"$f":"AK127","v":87.760873700257221},4.0470077838627563E-2,3.9688775731292619E-2,3.8917371989653352E-2,3.8155741210690153E-2,3.7403759580122292E-2,3.6661304852279863E-2,3.5928256330231154E-2,3.494619147455201E-2,null,"L2",{"$f":"$R$3","v":7.1},7.1,7.1,7.1,7.1,7.1,7.1,7.1,7.1,7.1,7.1,null,{"$f":"IF(CT127-$DE$27<=0,10000,CT127-$DE$27)","v":87.760873700257221},1,{"$f":"BU127","v":87.760873700257221},null,null,null,null,null,null,null,null,null,null,null,null,null,{"$f":"IF($DT127-EE$128<=0,10000,$DT127-EE$128)","v":10000},{"$f":"IF($DT127-EF$128<=0,10000,$DT127-EF$128)","v":10000},10000,10000,10000,10000,10000,10000,10000,10000,10000,1,{"$f":"CT127","v":87.760873700257221},0.12,0.05,1.0000000000000001E-5,1.0000000000000001E-5,1.0000000000000001E-5,1.0000000000000001E-5,1.0000000000000001E-5,1.0000000000000001E-5,null,"L3",{"$f":"$R$4","v":4.9000000000000004},4.9000000000000004,4.9000000000000004,4.9000000000000004,4.9000000000000004,4.9000000000000004,4.9000000000000004,4.9000000000000004,4.9000000000000004,4.9000000000000004,4.9000000000000004]
[null,null,null,null,null,null,null,{"$f":"H97","v":125.64109874496727},null,{"$f":"IF(L128-$W$27<=0,10000,L128-$W$27)","v":115.79824769121407},2,{"$f":"H128/$J$21","v":115.79824769121407},null,null,null,null,null,null,null,null,null,null,null,null,{"$f":"IF($AK128-AV$128<=0,10000,$AK128-AV$128)","v":10000},10000,10000,10000,10000,10000,10000,10000,10000,10000,10000,2,{"$f":"L128","v":115.79824769121407},5.5364704737271481E-2,5.4422494175469849E-2,5.3576105419969183E-2,5.2815793495564353E-2,5.2132804480604873E-2,5.15192747179085E-2,5.0968140275817066E-2,5.0307429918488432E-2,null,"Q1",{"$f":"B8","v":802.38039303573726},{"$f":"C8","v":495.73820461443637},439.72258827382211,395.08070113942392,358.66773329247241,280.97797156847116,230.95221995390656,196.047602328631,170.30831099445626,150.54332325815574,137.2678979267487,null,null,{"$f":"IF($BU128-CF$128<=0,10000,$BU128-CF$128)","v":10000},10000,10000,10000,10000,10000,10000,10000,10000,10000,10000,2,{"$f":"AK128","v":115.79824769121407},4.4920708561285494E-2,4.4083021132503716E-2,4.3255946418612759E-2,4.2439349966458026E-2,4.1633099026280443E-2,4.083706253013597E-2,4.0051111070588674E-2,3.899817216753497E-2,null,"Q2",{"$f":"B8","v":802.38039303573726},{"$f":"C8","v":495.73820461443637},439.72258827382211,395.08070113942392,358.66773329247241,280.97797156847116,230.95221995390656,196.047602328631,170.30831099445626,150.54332325815574,137.2678979267487,null,{"$f":"IF(CT128-$DE$27<=0,10000,CT128-$DE$27)","v":115.79824769121407},2,{"$f":"BU128","v":115.79824769121407},null,null,null,null,null,null,null,null,null,null,null,null,null,{"$f":"IF($DT128-EE$128<=0,10000,$DT128-EE$128)","v":10000},10000,10000,10000,10000,10000,10000,10000,10000,10000,10000,2,{"$f":"CT128","v":115.79824769121407},0.23,0.16,7.0000000000000007E-2,0.05,0.04,0.03,0.02,0.01,null,"Q3",{"$f":"B8","v":802.38039303573726},{"$f":"C8","v":495.73820461443637},439.72258827382211,395.08070113942392,358.66773329247241,280.97797156847116,230.95221995390656,196.047602328631,170.30831099445626,150.54332325815574,137.2678979267487]
[null,null,null,null,null,null,null,137.17143957099856,null,126.42528992718762,3,126.42528992718762,null,null,null,null,null,null,null,null,null,null,null,null,10000,10000,10000,10000,10000,10000,10000,10000,10000,10000,10000,3,{"$f":"L129","v":126.42528992718762},5.6055635508297855E-2,5.5043158026135998E-2,5.4133648420914837E-2,5.3316634969688949E-2,5.2582710912535406E-2,5.19234261469535E-2,5.1331189936828218E-2,5.0621206005267073E-2,null,"v1",{"$f":"FORECAST(AV128,AV145:AV146,AV132:AV133)","v":{"$error":"#N/A"}},{"$f":"FORECAST(AW128,AW145:AW146,AW132:AW133)","v":{"$error":"#N/A"}},8.0253261461447581E-2,7.1805724250006892E-2,6.6467869323422982E-2,5.8555479826519846E-2,5.5167733771901081E-2,5.3470622046129818E-2,5.233795684790201E-2,5.1649376443987746E-2,5.1186881963404526E-2,null,null,10000,10000,10000,10000,10000,10000,10000,10000,10000,10000,10000,3,{"$f":"AK129","v":126.42528992718762},4.6867855120326762E-2,4.6005499168929376E-2,4.5154068459492325E-2,4.4313424579435864E-2,4.3483430869737966E-2,4.2663952402718336E-2,4.185485596010402E-2,4.0770909731107002E-2,null,"v2",{"$f":"FORECAST(CF128,CF145:CF146,CF132:CF133)","v":{"$error":"#N/A"}},{"$f":"FORECAST(CG128,CG145:CG146,CG132:CG133)","v":{"$error":"#N/A"}},0.11717621402580217,0.10219176952202288,9.1168126736451777E-2,7.0939014600598649E-2,5.9895954329684128E-2,5.3170945535190681E-2,4.8425394363263125E-2,{"$f":"FORECAST(CO128,CO145:CO146,CO132:CO133)","v":4.5107033780247829E-2},{"$f":"FORECAST(CP128,CP145:CP146,CP132:CP133)","v":4.2878211342802217E-2},null,126.42528992718762,3,{"$f":"BU129","v":126.42528992718762},null,null,null,null,null,null,null,null,null,null,null,null,null,10000,10000,10000,10000,10000,10000,10000,10000,10000,10000,10000,3,{"$f":"CT129","v":126.42528992718762},0.33,0.21,0.13,0.1,0.06,0.06,0.06,0.16,null,"v3",{"$f":"FORECAST(EE128,EE145:EE146,EE132:EE133)","v":{"$error":"#N/A"}},{"$f":"FORECAST(EF128,EF145:EF146,EF132:EF133)","v":{"$error":"#N/A"}},0.66610966147529715,0.57155253943932727,0.52301097688628229,0.40399390582152861,0.31484410401935237,0.22437185283541117,0.17237009810512591,0.15487618655306787,0.14312616071636811]
[null,null,null,null,null,null,null,194.13767637642064,null,178.92873398748446,4,178.92873398748446,null,null,null,null,null,null,null,null,null,null,null,null,10000,10000,10000,10000,10000,10000,10000,10000,8.6204229930281997,28.385410729328726,41.660836060735761,4,178.92873398748446,5.9922625237430555E-2,5.8516879036136234E-2,5.7254095719859018E-2,5.6119736116112734E-2,5.5100739670701233E-2,5.4185374073819917E-2,5.3363100179021856E-2,5.2377342735171334E-2,null,"L1min",{"$f":"HLOOKUP(AV140,$AL$24:$AS$25,2,0)","v":4.4000000000000004},{"$f":"HLOOKUP(AW140,$AL$24:$AS$25,2,0)","v":4.4000000000000004},4.4000000000000004,4.4000000000000004,4.4000000000000004,4.4000000000000004,4.4000000000000004,4.4000000000000004,4.4000000000000004,4.4000000000000004,4.4000000000000004,null,null,10000,10000,10000,10000,10000,10000,10000,10000,8.6204229930281997,28.385410729328726,41.660836060735761,4,178.92873398748446,5.6505321132667499E-2,5.5520867516264505E-2,5.4548886004843811E-2,5.3589218588520407E-2,5.2641709259246577E-2,5.1706203985450297E-2,5.0782550686995331E-2,4.9545132677189366E-2,null,"L2min",{"$f":"HLOOKUP(CF140,$BV$24:$CC$25,2,0)","v":6.6},{"$f":"HLOOKUP(CG140,$BV$24:$CC$25,2,0)","v":6.6},6.6,6.6,6.6,6.6,6.6,6.6,6.6,6.6,6.6,null,178.92873398748446,4,178.92873398748446,null,null,null,null,null,null,null,null,null,null,null,null,null,10000,10000,10000,10000,10000,10000,10000,10000,8.6204229930281997,28.385410729328726,41.660836060735761,4,178.92873398748446,0.49,0.39,0.31,0.28000000000000003,0.22,0.19,0.18,0.18,null,"L3min",{"$f":"HLOOKUP(EE140,$DU$24:$EB$25,2,0)","v":4.4000000000000004},{"$f":"HLOOKUP(EF140,$DU$24:$EB$25,2,0)","v":4.4000000000000004},4.4000000000000004,4.4000000000000004,4.4000000000000004,4.4000000000000004,4.4000000000000004,4.4000000000000004,4.4000000000000004,4.4000000000000004,4.4000000000000004]
[null,null,null,null,null,null,null,250.77153348795648,null,231.12583731608893,5,231.12583731608893,null,null,null,null,null,null,null,null,null,null,null,null,10000,10000,10000,10000,10000,10000,0.17361736218236956,35.078234987457932,60.81752632163267,80.582514057933196,93.857939389340231,5,231.12583731608893,6.5288012426117065E-2,6.333661208681246E-2,6.1583667074702406E-2,6.0008994695288684E-2,5.8594464812515165E-2,5.7323791105769732E-2,5.6182343555825909E-2,5.481395471818877E-2,null,"L1max",{"$f":"HLOOKUP(AV141,$AL$24:$AS$25,2,0)","v":5.08},5.08,5.08,5.08,5.08,5.08,5.08,5.08,5.08,5.08,5.08,null,null,10000,10000,10000,10000,10000,10000,0.17361736218236956,35.078234987457932,60.81752632163267,80.582514057933196,93.857939389340231,5,231.12583731608893,6.7500553563040924E-2,6.6376800653211263E-2,6.5267284639901696E-2,6.417182515497187E-2,6.3090244115376864E-2,6.2022365694216985E-2,6.0968016292154731E-2,5.9555504756795746E-2,null,"L2max",{"$f":"HLOOKUP(CF141,$BV$24:$CC$25,2,0)","v":7.2799999999999994},7.2799999999999994,7.2799999999999994,7.2799999999999994,7.2799999999999994,7.2799999999999994,7.2799999999999994,7.2799999999999994,7.2799999999999994,7.2799999999999994,7.2799999999999994,null,231.12583731608893,5,231.12583731608893,null,null,null,null,null,null,null,null,null,null,null,null,null,10000,10000,10000,10000,10000,10000,0.17361736218236956,35.078234987457932,60.81752632163267,80.582514057933196,93.857939389340231,5,231.12583731608893,0.65,0.53,0.42,0.42,0.37,0.36,0.33,0.31,null,"L3max",{"$f":"HLOOKUP(EE141,$DU$24:$EB$25,2,0)","v":5.08},5.08,5.08,5.08,5.08,5.08,5.08,5.08,5.08,5.08,5.08]
[null,null,null,null,null,null,null,307.26816414438485,null,283.19646464920265,6,283.19646464920265,null,null,null,null,null,null,null,null,null,null,null,null,10000,10000,10000,10000,10000,2.2184930807314913,52.244244695296089,87.148862320571652,112.88815365474639,132.65314139104692,145.92856672245395,6,283.19646464920265,7.2750154286605126E-2,7.0039862101958825E-2,6.760520373343068E-2,6.5418147516752817E-2,6.3453512577929388E-2,6.1688678910915187E-2,6.0103326940084398E-2,5.8202777115681475E-2,null,"Qmin",{"$f":"VLOOKUP(AV142,$AJ$96:$AK$108,2,0)","v":{"$error":"#N/A"}},{"$f":"VLOOKUP(AW142,$AJ$96:$AK$108,2,0)","v":{"$error":"#N/A"}},432.99311881688482,365.81055797098225,346.2244862518063,231.12583731608893,178.92873398748446,178.92873398748446,126.42528992718762,126.42528992718762,126.42528992718762,null,null,10000,10000,10000,10000,10000,2.2184930807314913,52.244244695296089,87.148862320571652,112.88815365474639,132.65314139104692,145.92856672245395,6,283.19646464920265,8.0073267040863289E-2,7.8790229630682496E-2,7.752344710240712E-2,7.6272713521912644E-2,7.5037825564067018E-2,7.3818582479677056E-2,7.261478606285382E-2,7.1002060412646437E-2,null,"Qmin",{"$f":"VLOOKUP(CF142,$BT$127:$BU$139,2,0)","v":{"$error":"#N/A"}},{"$f":"VLOOKUP(CG142,$BT$127:$BU$139,2,0)","v":{"$error":"#N/A"}},432.99311881688482,365.81055797098225,346.2244862518063,231.12583731608893,178.92873398748446,178.92873398748446,126.42528992718762,126.42528992718762,126.42528992718762,null,283.19646464920265,6,283.19646464920265,null,null,null,null,null,null,null,null,null,null,null,null,null,10000,10000,10000,10000,10000,2.2184930807314913,52.244244695296089,87.148862320571652,112.88815365474639,132.65314139104692,145.92856672245395,6,283.19646464920265,0.82,0.63,0.56000000000000005,0.56000000000000005,0.47,0.46,0.43,0.4,null,"Qmin",{"$f":"VLOOKUP(EE142,$DS$127:$DT$139,2,0)","v":{"$error":"#N/A"}},{"$f":"VLOOKUP(EF142,$DS$127:$DT$139,2,0)","v":{"$error":"#N/A"}},432.99311881688482,365.81055797098225,346.2244862518063,231.12583731608893,178.92873398748446,178.92873398748446,126.42528992718762,126.42528992718762,126.42528992718762]
[null,null,null,null,null,null,null,327.15697974421488,null,301.5271702711658,7,301.5271702711658,null,null,null,null,null,null,null,null,null,null,null,null,10000,10000,10000,10000,10000,20.549198702694639,70.574950317259237,105.4795679425348,131.21885927670954,150.98384701301006,164.2592723444171,7,301.5271702711658,7.6025434162581895E-2,7.2982049517947442E-2,7.0248173836320038E-2,6.779233038722772E-2,6.5586243590018481E-2,6.3604513460347664E-2,6.182432316510942E-2,5.9690197484964201E-2,null,"Qmax",{"$f":"VLOOKUP(AV143,$AJ$96:$AK$108,2,0)","v":87.760873700257221},87.760873700257221,462.95711094274202,400.8057637723976,365.81055797098225,283.19646464920265,231.12583731608893,231.12583731608893,178.92873398748446,178.92873398748446,178.92873398748446,null,null,10000,10000,10000,10000,10000,20.549198702694639,70.574950317259237,105.4795679425348,131.21885927670954,150.98384701301006,164.2592723444171,7,301.5271702711658,8.4922567212112193E-2,8.3578093712085522E-2,8.2250653431662962E-2,8.0940030575910565E-2,7.9646012083814097E-2,7.8368387593642688E-2,7.7106949408751527E-2,7.5417001101467512E-2,null,"Qmax",{"$f":"VLOOKUP(CF143,$BT$127:$BU$139,2,0)","v":87.760873700257221},87.760873700257221,462.95711094274202,400.8057637723976,365.81055797098225,283.19646464920265,231.12583731608893,231.12583731608893,178.92873398748446,178.92873398748446,178.92873398748446,null,301.5271702711658,7,301.5271702711658,null,null,null,null,null,null,null,null,null,null,null,null,null,10000,10000,10000,10000,10000,20.549198702694639,70.574950317259237,105.4795679425348,131.21885927670954,150.98384701301006,164.2592723444171,7,301.5271702711658,0.88,0.7,0.59,0.53,0.49,0.48,0.47,0.41,null,"Qmax",{"$f":"VLOOKUP(EE143,$DS$127:$DT$139,2,0)","v":87.760873700257221},87.760873700257221,462.95711094274202,400.8057637723976,365.81055797098225,283.19646464920265,231.12583731608893,231.12583731608893,178.92873398748446,178.92873398748446,178.92873398748446]
[null,null,null,null,null,null,null,354.91500974957086,null,327.11060806412064,8,327.11060806412064,null,null,null,null,null,null,null,null,null,null,null,null,10000,10000,10000,10000,10000,46.132636495649479,96.158388110214077,131.06300573548964,156.80229706966438,176.5672848059649,189.84271013737194,8,327.11060806412064,8.1287572383794915E-2,7.7709033910702108E-2,7.4494428972544005E-2,7.1606745918098763E-2,6.9012737141484343E-2,6.6682536282773638E-2,6.4589314358897615E-2,6.2079920462112581E-2,null,null,null,null,null,null,null,null,null,null,null,null,null,null,null,10000,10000,10000,10000,10000,46.132636495649479,96.158388110214077,131.06300573548964,156.80229706966438,176.5672848059649,189.84271013737194,8,327.11060806412064,9.2090664405737169E-2,9.0655377830078987E-2,8.9238274990610114E-2,8.7839125516429403E-2,8.6457701955219263E-2,8.5093779736269762E-2,8.3747137133971555E-2,8.1943040497665279E-2,null,null,null,null,null,null,null,null,null,null,null,null,null,null,327.11060806412064,8,327.11060806412064,null,null,null,null,null,null,null,null,null,null,null,null,null,10000,10000,10000,10000,10000,46.132636495649479,96.158388110214077,131.06300573548964,156.80229706966438,176.5672848059649,189.84271013737194,8,327.11060806412064,0.96,0.77,0.65,0.6,0.53,0.51,0.48,0.47]
[null,null,null,null,null,null,null,375.65356758320979,null,346.2244862518063,9,346.2244862518063,null,null,null,null,null,null,null,null,null,null,null,null,10000,10000,10000,10000,10000,65.246514683335135,115.27226629789973,150.1768839231753,175.91617525735003,195.68116299365056,208.9565883250576,9,346.2244862518063,8.5820304552208931E-2,8.1780792066019237E-2,7.8152093678815981E-2,7.4892430036158988E-2,7.1964270699265406E-2,6.9333902034832237E-2,6.6971039050001638E-2,6.4138394366969761E-2,null,"Lmin Q min",{"$f":"INDEX($AL$127:$AS$139,AV142,AV140)","v":6.6971039050001638E-2},{"$f":"INDEX($AL$127:$AS$139,AW142,AW140)","v":6.6971039050001638E-2},8.232788570682642E-2,6.973311170272159E-2,6.6971039050001638E-2,5.6182343555825909E-2,5.3363100179021856E-2,5.3363100179021856E-2,5.1331189936828218E-2,5.1331189936828218E-2,5.1331189936828218E-2,null,null,10000,10000,10000,10000,10000,65.246514683335135,115.27226629789973,150.1768839231753,175.91617525735003,195.68116299365056,208.9565883250576,9,346.2244862518063,9.7767427988578098E-2,9.6260222136902107E-2,9.4772111171261192E-2,9.3302853177339315E-2,9.1852209305648233E-2,9.041994373269889E-2,8.9005823622664904E-2,8.7111327392194099E-2,null,"Lmin Q min",{"$f":"INDEX($BV$127:$CC$139,CF142,CF140)","v":8.9005823622664904E-2},{"$f":"INDEX($BV$127:$CC$139,CG142,CG140)","v":8.9005823622664904E-2},0.11647163146426037,9.4673645851665891E-2,8.9005823622664904E-2,6.0968016292154731E-2,5.0782550686995331E-2,5.0782550686995331E-2,4.185485596010402E-2,4.185485596010402E-2,4.185485596010402E-2,null,346.2244862518063,9,346.2244862518063,null,null,null,null,null,null,null,null,null,null,null,null,null,10000,10000,10000,10000,10000,65.246514683335135,115.27226629789973,150.1768839231753,175.91617525735003,195.68116299365056,208.9565883250576,9,346.2244862518063,0.99,0.8,0.73,0.63,0.57999999999999996,0.55000000000000004,0.53,0.49,null,"Lmin Q min",{"$f":"INDEX($DU$127:$EB$139,EE142,EE140)","v":0.53},{"$f":"INDEX($DU$127:$EB$139,EF142,EF140)","v":0.53},0.72,0.57999999999999996,0.53,0.33,0.18,0.18,0.06,0.06,0.06]
[null,null,null,null,null,null,null,396.90445539851572,null,365.81055797098225,10,365.81055797098225,null,null,null,null,null,null,null,null,null,null,null,null,10000,10000,10000,10000,7.1428246785098395,84.832586402511083,134.85833801707568,169.76295564235124,195.50224697652598,215.26723471282651,228.54266004423354,10,365.81055797098225,9.107688840979869E-2,8.6502786967989936E-2,8.2393866750131717E-2,7.8702819323328718E-2,7.5387147471707716E-2,7.2408675900792668E-2,6.973311170272159E-2,6.6525594911256078E-2,null,"Lmax Q min",{"$f":"INDEX($AL$127:$AS$139,AV142,AV141)","v":6.6525594911256078E-2},{"$f":"INDEX($AL$127:$AS$139,AW142,AW141)","v":6.6525594911256078E-2},7.7410989735376426E-2,6.6525594911256078E-2,6.4138394366969761E-2,5.481395471818877E-2,5.2377342735171334E-2,5.2377342735171334E-2,5.0621206005267073E-2,5.0621206005267073E-2,5.0621206005267073E-2,null,null,10000,10000,10000,10000,7.1428246785098395,84.832586402511083,134.85833801707568,169.76295564235124,195.50224697652598,215.26723471282651,228.54266004423354,10,365.81055797098225,0.10388585449922633,0.10230113391603253,0.10073649025789835,9.9191669168993413E-2,9.7666419515937394E-2,9.6160493346974629E-2,9.4673645851665891E-2,9.2681716767877037E-2,null,"Lmax Q min",{"$f":"INDEX($BV$127:$CC$139,CF142,CF141)","v":9.2681716767877037E-2},{"$f":"INDEX($BV$127:$CC$139,CG142,CG141)","v":9.2681716767877037E-2},0.1141049835115639,9.2681716767877037E-2,8.7111327392194099E-2,5.9555504756795746E-2,4.9545132677189366E-2,4.9545132677189366E-2,4.0770909731107002E-2,4.0770909731107002E-2,4.0770909731107002E-2,null,365.81055797098225,10,365.81055797098225,null,null,null,null,null,null,null,null,null,null,null,null,null,10000,10000,10000,10000,7.1428246785098395,84.832586402511083,134.85833801707568,169.76295564235124,195.50224697652598,215.26723471282651,228.54266004423354,10,365.81055797098225,1.04,0.86,0.79,0.67,0.62,0.6,0.57999999999999996,0.52,null,"Lmax Q min",{"$f":"INDEX($DU$127:$EB$139,EE142,EE141)","v":0.52},{"$f":"INDEX($DU$127:$EB$139,EF142,EF141)","v":0.52},0.63,0.52,0.49,0.31,0.18,0.18,0.16,0.16,0.16]
[null,null,null,null,null,null,null,434.8742536930514,null,400.8057637723976,11,400.8057637723976,null,null,null,null,null,null,null,null,null,null,null,null,10000,10000,10000,5.7250626329736747,42.138030479925192,119.82779220392644,169.85354381849103,204.7581614437666,230.49745277794133,250.26244051424186,263.53786584564887,11,400.8057637723976,0.10227695199452241,9.6563816066280089E-2,9.1431699950891898E-2,8.6821514554877646E-2,8.2680180082359472E-2,7.8960014895923594E-2,7.5618186529678583E-2,7.1611939695214899E-2,null,"Lmin Q max",{"$f":"INDEX($AL$127:$AS$139,AV143,AV140)","v":5.0196033213319238E-2},{"$f":"INDEX($AL$127:$AS$139,AW143,AW140)","v":5.0196033213319238E-2},8.9948797699925309E-2,7.5618186529678583E-2,6.973311170272159E-2,6.0103326940084398E-2,5.6182343555825909E-2,5.6182343555825909E-2,5.3363100179021856E-2,5.3363100179021856E-2,5.3363100179021856E-2,null,null,10000,10000,10000,5.7250626329736747,42.138030479925192,119.82779220392644,169.85354381849103,204.7581614437666,230.49745277794133,250.26244051424186,263.53786584564887,11,400.8057637723976,0.11562786280541335,0.11389438197810287,0.11218286272877107,0.11049302682480078,0.1088245995585215,0.10717730970255146,0.10555088946570576,0.10337197482754852,null,"Lmin Q max",{"$f":"INDEX($BV$127:$CC$139,CF143,CF140)","v":3.5928256330231154E-2},{"$f":"INDEX($BV$127:$CC$139,CG143,CG140)","v":3.5928256330231154E-2},0.12749667868258735,0.10555088946570576,9.4673645851665891E-2,7.261478606285382E-2,6.0968016292154731E-2,6.0968016292154731E-2,5.0782550686995331E-2,5.0782550686995331E-2,5.0782550686995331E-2,null,400.8057637723976,11,400.8057637723976,null,null,null,null,null,null,null,null,null,null,null,null,null,10000,10000,10000,5.7250626329736747,42.138030479925192,119.82779220392644,169.85354381849103,204.7581614437666,230.49745277794133,250.26244051424186,263.53786584564887,11,400.8057637723976,1.1599999999999999,0.94,0.83,0.75,0.71,0.65,0.63,0.56000000000000005,null,"Lmin Q max",{"$f":"INDEX($DU$127:$EB$139,EE143,EE140)","v":1.0000000000000001E-5},{"$f":"INDEX($DU$127:$EB$139,EF143,EF140)","v":1.0000000000000001E-5},0.76,0.63,0.57999999999999996,0.43,0.33,0.33,0.18,0.18,0.18]
[null,null,null,null,null,null,null,469.79753391631999,null,432.99311881688482,12,432.99311881688482,null,null,null,null,null,null,null,null,null,null,null,null,10000,10000,10000,37.912417677460894,74.325385524412411,152.01514724841365,202.04089886297825,236.94551648825382,262.68480782242852,282.44979555872908,295.72522089013614,12,432.99311881688482,0.11504638307706339,0.10803460966653131,0.1017359261117164,9.6077811937047841E-2,9.0995121921748925E-2,8.642933604431341E-2,8.232788570682642E-2,7.7410989735376426E-2,null,"Lmax Q max",{"$f":"INDEX($AL$127:$AS$139,AV143,AV141)","v":4.9640114235091376E-2},{"$f":"INDEX($AL$127:$AS$139,AW143,AW141)","v":4.9640114235091376E-2},8.3997581597820226E-2,7.1611939695214899E-2,6.6525594911256078E-2,5.8202777115681475E-2,5.481395471818877E-2,5.481395471818877E-2,5.2377342735171334E-2,5.2377342735171334E-2,5.2377342735171334E-2,null,null,10000,10000,10000,37.912417677460894,74.325385524412411,152.01514724841365,202.04089886297825,236.94551648825382,262.68480782242852,282.44979555872908,295.72522089013614,12,432.99311881688482,0.12741682771296009,0.12553399174538751,0.12367500954548943,0.12183957890837807,0.12002740145781846,0.11823818259772295,0.11647163146426037,0.1141049835115639,null,"Lmax Q max",{"$f":"INDEX($BV$127:$CC$139,CF143,CF141)","v":3.494619147455201E-2},{"$f":"INDEX($BV$127:$CC$139,CG143,CG141)","v":3.494619147455201E-2},0.12494050435361337,0.10337197482754852,9.2681716767877037E-2,7.1002060412646437E-2,5.9555504756795746E-2,5.9555504756795746E-2,4.9545132677189366E-2,4.9545132677189366E-2,4.9545132677189366E-2,null,432.99311881688482,12,432.99311881688482,null,null,null,null,null,null,null,null,null,null,null,null,null,10000,10000,10000,37.912417677460894,74.325385524412411,152.01514724841365,202.04089886297825,236.94551648825382,262.68480782242852,282.44979555872908,295.72522089013614,12,432.99311881688482,1.26,1.02,0.93,0.84,0.75,0.72,0.72,0.63,null,"Lmax Q max",{"$f":"INDEX($DU$127:$EB$139,EE143,EE141)","v":1.0000000000000001E-5},{"$f":"INDEX($DU$127:$EB$139,EF143,EF141)","v":1.0000000000000001E-5},0.69,0.56000000000000005,0.52,0.4,0.31,0.31,0.18,0.18,0.18]
[null,null,null,null,null,null,null,502.30846537287511,null,462.95711094274202,13,462.95711094274202,null,null,null,null,null,null,null,null,null,null,null,null,10000,10000,23.234522668919908,67.876409803318097,104.28937765026961,181.97913937427086,232.00489098883546,266.90950861411102,292.64879994828573,312.41378768458628,325.68921301599335,13,462.95711094274202,0.12954997078087949,0.12106319801461227,0.11343952096080942,0.10659116370872247,0.10043927706383673,9.491303071037864E-2,8.9948797699925309E-2,8.3997581597820226E-2,null,"Index",null,null,null,null,null,null,null,null,null,null,null,null,null,10000,10000,23.234522668919908,67.876409803318097,104.28937765026961,181.97913937427086,232.00489098883546,266.90950861411102,292.64879994828573,312.41378768458628,325.68921301599335,13,462.95711094274202,0.13931839033371474,0.13728477271834683,0.13527691913286322,0.13329450317114364,0.13133720256232764,0.1294046991184245,0.12749667868258735,0.12494050435361337,null,"Index",null,null,null,null,null,null,null,null,null,null,null,null,462.95711094274202,13,462.95711094274202,null,null,null,null,null,null,null,null,null,null,null,null,null,10000,10000,23.234522668919908,67.876409803318097,104.28937765026961,181.97913937427086,232.00489098883546,266.90950861411102,292.64879994828573,312.41378768458628,325.68921301599335,13,462.95711094274202,1.36,1.08,0.97,0.88,0.82,0.77,0.76,0.69,null,"Index"]
[null,null,null,null,null,null,null,null,null,"Qmax","index",null,null,null,null,null,null,null,null,null,null,null,null,null,"Qmax","Qmax","Qmax","Qmax","Qmax","Qmax","Qmax","Qmax","Qmax","Qmax","Qmax","index",null,null,null,null,null,null,null,null,null,null,"L1min",{"$f":"AV141-1","v":7},{"$f":"AW141-1","v":7},7,7,7,7,7,7,7,7,7,null,null,"Qmax","Qmax","Qmax","Qmax","Qmax","Qmax","Qmax","Qmax","Qmax","Qmax","Qmax","index",null,null,null,null,null,null,null,null,null,null,"L2min",{"$f":"CF141-1","v":7},{"$f":"CG141-1","v":7},7,7,7,7,7,7,7,7,7,null,"Qmax","index",null,null,null,null,null,null,null,null,null,null,null,null,null,null,"Qmax","Qmax","Qmax","Qmax","Qmax","Qmax","Qmax","Qmax","Qmax","Qmax","Qmax","index",null,null,null,null,null,null,null,null,null,null,"L3min",{"$f":"EE141-1","v":7},{"$f":"EF141-1","v":7},7,7,7,7,7,7,7,7,7]
[null,null,null,null,null,null,null,null,null,{"$f":"MIN(J127:J139)","v":87.760873700257221},null,null,null,null,null,null,null,null,null,null,null,null,null,null,{"$f":"MIN(Y127:Y139)","v":10000},{"$f":"MIN(Z127:Z139)","v":10000},23.234522668919908,5.7250626329736747,7.1428246785098395,2.2184930807314913,0.17361736218236956,35.078234987457932,8.6204229930281997,28.385410729328726,41.660836060735761,null,null,null,null,null,null,null,null,null,null,null,"L1max",{"$f":"HLOOKUP(AU124,AL124:AS125,2,0)","v":8},{"$f":"HLOOKUP($ED$23,$DU$23:$EB$24,2,0)","v":8},8,8,8,8,8,8,8,8,8,null,null,{"$f":"MIN(BI127:BI139)","v":10000},{"$f":"MIN(BJ127:BJ139)","v":10000},23.234522668919908,5.7250626329736747,7.1428246785098395,2.2184930807314913,0.17361736218236956,35.078234987457932,8.6204229930281997,28.385410729328726,41.660836060735761,null,null,null,null,null,null,null,null,null,null,null,"L2max",{"$f":"HLOOKUP(CE124,BV124:CC125,2,0)","v":8},{"$f":"HLOOKUP($ED$23,$DU$23:$EB$24,2,0)","v":8},8,8,8,8,8,8,8,8,8,null,{"$f":"MIN(CR127:CR139)","v":87.760873700257221},null,null,null,null,null,null,null,null,null,null,null,null,null,null,null,{"$f":"MIN(DH127:DH139)","v":10000},{"$f":"MIN(DI127:DI139)","v":10000},23.234522668919908,5.7250626329736747,7.1428246785098395,2.2184930807314913,0.17361736218236956,35.078234987457932,8.6204229930281997,28.385410729328726,41.660836060735761,null,null,null,null,null,null,null,null,null,null,null,"L3max",{"$f":"HLOOKUP($ED$23,$DU$23:$EB$24,2,0)","v":8},{"$f":"HLOOKUP($ED$23,$DU$23:$EB$24,2,0)","v":8},8,8,8,8,8,8,8,8,8]
[null,null,null,null,null,null,null,null,null,null,null,null,null,null,null,null,null,null,null,null,null,null,null,null,null,null,null,null,null,null,null,null,null,null,null,null,null,null,null,null,null,null,null,null,null,null,"Qmin",{"$f":"AV143-1","v":0},{"$f":"AW143-1","v":0},12,10,9,5,4,4,3,3,3,null,null,null,null,null,null,null,null,null,null,null,null,null,null,null,null,null,null,null,null,null,null,null,null,"Qmin",{"$f":"CF143-1","v":0},{"$f":"CG143-1","v":0},12,10,9,5,4,4,3,3,3,null,null,null,null,null,null,null,null,null,null,null,null,null,null,null,null,null,null,null,null,null,null,null,null,null,null,null,null,null,null,null,null,null,null,null,null,null,null,null,"Qmin",{"$f":"EE143-1","v":0},{"$f":"EF143-1","v":0},12,10,9,5,4,4,3,3,3]
[null,null,null,null,null,null,null,null,null,null,null,null,null,null,null,null,null,null,null,null,null,null,null,null,null,null,null,null,null,null,null,null,null,null,null,null,null,null,null,null,null,null,null,null,null,null,"Qmax",{"$f":"VLOOKUP(Y141,Y127:$AJ$139,12,0)","v":1},{"$f":"VLOOKUP(Z141,Z127:$AJ$139,11,0)","v":1},{"$f":"VLOOKUP(AA141,AA127:$AJ$139,10,0)","v":13},{"$f":"VLOOKUP(AB141,AB127:$AJ$139,9,0)","v":11},{"$f":"VLOOKUP(AC141,AC127:$AJ$139,8,0)","v":10},{"$f":"VLOOKUP(AD141,AD127:$AJ$139,7,0)","v":6},{"$f":"VLOOKUP(AE141,AE127:$AJ$139,6,0)","v":5},{"$f":"VLOOKUP(AF141,AF127:$AJ$139,5,0)","v":5},{"$f":"VLOOKUP(AG141,AG127:$AJ$139,4,0)","v":4},{"$f":"VLOOKUP(AH141,AH127:$AJ$139,3,0)","v":4},{"$f":"VLOOKUP(AI141,AI127:$AJ$139,2,0)","v":4},null,null,null,null,null,null,null,null,null,null,null,null,null,null,null,null,null,null,null,null,null,null,null,null,"Qmax",{"$f":"VLOOKUP(BI141,BI127:$BT$139,12,0)","v":1},{"$f":"VLOOKUP(BJ141,BJ127:$BT$139,11,0)","v":1},{"$f":"VLOOKUP(BK141,BK127:$BT$139,10,0)","v":13},{"$f":"VLOOKUP(BL141,BL127:$BT$139,9,0)","v":11},{"$f":"VLOOKUP(BM141,BM127:$BT$139,8,0)","v":10},{"$f":"VLOOKUP(BN141,BN127:$BT$139,7,0)","v":6},{"$f":"VLOOKUP(BO141,BO127:$BT$139,6,0)","v":5},{"$f":"VLOOKUP(BP141,BP127:$BT$139,5,0)","v":5},{"$f":"VLOOKUP(BQ141,BQ127:$BT$139,4,0)","v":4},{"$f":"VLOOKUP(BR141,BR127:$BT$139,3,0)","v":4},{"$f":"VLOOKUP(BS141,BS127:$BT$139,2,0)","v":4},null,null,null,null,null,null,null,null,null,null,null,null,null,null,null,null,null,null,null,null,null,null,null,null,null,null,null,null,null,null,null,null,null,null,null,null,null,null,null,"Qmax",{"$f":"VLOOKUP(DH141,DH127:$DS$139,12,0)","v":1},{"$f":"VLOOKUP(DI141,DI127:$DS$139,11,0)","v":1},{"$f":"VLOOKUP(DJ141,DJ127:$DS$139,10,0)","v":13},{"$f":"VLOOKUP(DK141,DK127:$DS$139,9,0)","v":11},{"$f":"VLOOKUP(DL141,DL127:$DS$139,8,0)","v":10},{"$f":"VLOOKUP(DM141,DM127:$DS$139,7,0)","v":6},{"$f":"VLOOKUP(DN141,DN127:$DS$139,6,0)","v":5},{"$f":"VLOOKUP(DO141,DO127:$DS$139,5,0)","v":5},{"$f":"VLOOKUP(DP141,DP127:$DS$139,4,0)","v":4},{"$f":"VLOOKUP(DQ141,DQ127:$DS$139,3,0)","v":4},{"$f":"VLOOKUP(DR141,DR127:$DS$139,2,0)","v":4}]
[]
[null,null,null,null,null,null,null,null,null,null,null,null,null,null,null,null,null,null,null,null,null,null,null,null,null,null,null,null,null,null,null,null,null,null,null,null,null,null,null,null,null,null,null,null,null,null,"interp Qmin",{"$f":"FORECAST(AV127,AV135:AV136,AV130:AV131)","v":6.664350659504166E-2},{"$f":"FORECAST(AW127,AW135:AW136,AW130:AW131)","v":6.664350659504166E-2},{"$f":"FORECAST(AX127,AX135:AX136,AX130:AX131)","v":7.871252102193671E-2},6.7374643473702811E-2,6.4888212077184079E-2,5.5176175292857427E-2,5.2638278529131763E-2,5.2638278529131763E-2,{"$f":"FORECAST(BD127,BD135:BD136,BD130:BD131)","v":5.0809142928327375E-2},{"$f":"FORECAST(BE127,BE135:BE136,BE130:BE131)","v":5.0809142928327375E-2},{"$f":"FORECAST(BF127,BF135:BF136,BF130:BF131)","v":5.0809142928327375E-2},null,null,null,null,null,null,null,null,null,null,null,null,null,null,null,null,null,null,null,null,null,null,null,null,"interp Qmin",{"$f":"FORECAST(CF127,CF135:CF136,CF130:CF131)","v":9.1708686229438535E-2},9.1708686229438535E-2,0.11473144914610121,9.3208992113585853E-2,8.761281168849519E-2,5.9929404869096654E-2,4.9872684503314474E-2,4.9872684503314474E-2,4.1057836674076802E-2,4.1057836674076802E-2,4.1057836674076802E-2,null,null,null,null,null,null,null,null,null,null,null,null,null,null,null,null,null,null,null,null,null,null,null,null,null,null,null,null,null,null,null,null,null,null,null,null,null,null,null,"interp Qmin",{"$f":"FORECAST(EE127,EE135:EE136,EE130:EE131)","v":0.52264705882352946},{"$f":"FORECAST(EF127,EF135:EF136,EF130:EF131)","v":0.52264705882352946},{"$f":"FORECAST(EG127,EG135:EG136,EG130:EG131)","v":0.65382352941176491},0.53588235294117648,0.50058823529411767,0.31529411764705884,0.18,0.18,{"$f":"FORECAST(EM127,EM135:EM136,EM130:EM131)","v":0.1335294117647059},{"$f":"FORECAST(EN127,EN135:EN136,EN130:EN131)","v":0.1335294117647059},{"$f":"FORECAST(EO127,EO135:EO136,EO130:EO131)","v":0.1335294117647059}]
[null,null,null,null,null,null,null,null,null,null,null,null,null,null,null,null,null,null,null,null,null,null,null,null,null,null,null,null,null,null,null,null,null,null,null,null,null,null,null,null,null,null,null,null,null,null,"interp Qmax",{"$f":"FORECAST(AV127,AV137:AV138,AV130:AV131)","v":4.9787269258739927E-2},{"$f":"FORECAST(AW127,AW137:AW138,AW130:AW131)","v":4.9787269258739927E-2},8.5572903507200981E-2,7.2672416798455292E-2,6.7374643473702811E-2,5.8705863833905775E-2,5.5176175292857427E-2,5.5176175292857427E-2,5.2638278529131763E-2,5.2638278529131763E-2,5.2638278529131763E-2,null,null,null,null,null,null,null,null,null,null,null,null,null,null,null,null,null,null,null,null,null,null,null,null,"interp Qmax",{"$f":"FORECAST(CF127,CF137:CF138,CF130:CF131)","v":3.5206149818702369E-2},{"$f":"FORECAST(CG127,CG137:CG138,CG130:CG131)","v":3.5206149818702369E-2},0.12561713873481237,0.10394874634941367,9.3208992113585853E-2,7.1428958378877805E-2,5.9929404869096654E-2,5.9929404869096654E-2,4.9872684503314474E-2,4.9872684503314474E-2,4.9872684503314474E-2,null,null,null,null,null,null,null,null,null,null,null,null,null,null,null,null,null,null,null,null,null,null,null,null,null,null,null,null,null,null,null,null,null,null,null,null,null,null,null,"interp Qmax",{"$f":"FORECAST(EE127,EE137:EE138,EE130:EE131)","v":1.0000000000000001E-5},{"$f":"FORECAST(EF127,EF137:EF138,EF130:EF131)","v":1.0000000000000001E-5},0.70852941176470574,0.57852941176470574,0.53588235294117648,0.40794117647058825,0.31529411764705884,0.31529411764705884,0.18,0.18,0.18]

{"sheet":"noise","index":9,"n_rows":69,"n_cols":46,"rows_kept":69,"cut":false,"hidden":true,"merged":[[62,0,65,0],[13,0,16,0],[20,16,20,17],[20,26,20,27],[21,0,21,1],[21,8,21,9]]}
["COOLING"]
[]
["length beam","[mm]",600,600,600,600,900,900,900,900,1000,1000,1000,1000,1100,1100,1100,1100,1200,1200,1200,1200,1500,1500,1500,1500,1800,1800,1800,1800,2100,2100,2100,2100,2400,2400,2400,2400,2700,2700,2700,2700,2950,2950,2950,2950]
["nozzle","[]","A","B ","C","D","A","B ","C","D","A","B ","C","D","A","B ","C","D","A","B ","C","D","A","B ","C","D","A","B ","C","D","A","B ","C","D","A","B ","C","D","A","B ","C","D","A","B ","C","D"]
["no nozzles","[]",{"$f":"capacity!J14","v":28},{"$f":"capacity!K14","v":28},{"$f":"capacity!L14","v":28},{"$f":"capacity!M14","v":28},{"$f":"capacity!N14","v":46},{"$f":"capacity!O14","v":46},{"$f":"capacity!P14","v":46},{"$f":"capacity!Q14","v":46},{"$f":"capacity!R14","v":52},{"$f":"capacity!S14","v":52},{"$f":"capacity!T14","v":52},{"$f":"capacity!U14","v":52},{"$f":"capacity!V14","v":58},{"$f":"capacity!W14","v":58},{"$f":"capacity!X14","v":58},{"$f":"capacity!Y14","v":58},{"$f":"capacity!Z14","v":64},{"$f":"capacity!AA14","v":64},{"$f":"capacity!AB14","v":64},{"$f":"capacity!AC14","v":64},{"$f":"capacity!AD14","v":82},{"$f":"capacity!AE14","v":82},{"$f":"capacity!AF14","v":82},{"$f":"capacity!AG14","v":82},{"$f":"capacity!AH14","v":100},{"$f":"capacity!AI14","v":100},{"$f":"capacity!AJ14","v":100},{"$f":"capacity!AK14","v":100},{"$f":"capacity!AL14","v":118},{"$f":"capacity!AM14","v":118},{"$f":"capacity!AN14","v":118},{"$f":"capacity!AO14","v":118},{"$f":"capacity!AP14","v":136},{"$f":"capacity!AQ14","v":136},{"$f":"capacity!AR14","v":136},{"$f":"capacity!AS14","v":136},{"$f":"capacity!AT14","v":154},{"$f":"capacity!AU14","v":154},{"$f":"capacity!AV14","v":154},{"$f":"capacity!AW14","v":154},{"$f":"capacity!AX14","v":168},{"$f":"capacity!AY14","v":168},{"$f":"capacity!AZ14","v":168},{"$f":"capacity!BA14","v":168}]
["nozzle v","[m/s]",{"$f":"($C$20/3600)/C8","v":84.255766857034843},{"$f":"($C$20/3600)/D8","v":62.089360452582518},40.610033082024692,28.44138979275214,51.286118956456001,37.793523753745873,24.719150571667207,17.31215030863174,45.368489846095699,33.432732551390586,21.86694089032099,15.314594503789614,40.675197793051311,29.974174011591554,19.604843556839505,13.730326106845862,36.861897999952745,27.164095198004848,17.766889473385802,12.443108034329061,28.770261853621655,21.201245032589146,13.866840564593797,9.7116940755739023,23.591614719969762,17.385020926723104,11.370809262966914,7.9635891419705995,19.992893830482849,14.73306858196873,9.6362790364126401,6.7488043576022028,17.346775529389529,12.783103622590518,8.3608891639462612,5.8555802514489699,15.319230337642702,11.288974627742276,7.3836423785499443,5.1711617805003893,14.042627809505809,10.348226742097086,6.7683388470041157,4.740231632125357]
["Lw/nozzle ","[dB(A)]/nozzle",{"$f":"IF(C4<>\"D\",VLOOKUP(C4,$B$14:$D$17,3,1)*EXP(VLOOKUP(C4,$B$14:$E$17,4,1)*C6),$D$17*C6^2+$E$17*C6+$F$17)","v":3925019.7670887299},{"$f":"IF(D4<>\"D\",VLOOKUP(D4,$B$14:$D$17,3,1)*EXP(VLOOKUP(D4,$B$14:$E$17,4,1)*D6),$D$17*D6^2+$E$17*D6+$F$17)","v":72074.835926072657},1984.5305288407774,47.326481124556977,5425.3802040096034,483.24215596027511,54.349850094007806,20.274018094465568,1664.1882172328455,196.80136064193289,28.494229228075859,16.572194076664676,651.86814071684068,96.518223900644713,17.074100884731191,13.885945802233486,304.3950409504381,54.101158714052978,11.262176994083518,11.866003167511131,60.486886907000809,15.839526124435299,4.6575002156816483,8.0627515259313007,21.50425373309103,7.2164728149056119,2.6468688705207568,5.9732199146598512,10.481231714375838,4.1789671417325813,1.787252884904474,4.679540551051061,6.1789995747445703,2.7965075612229771,1.3390112556631331,3.8111543965760939,4.1216583827804776,2.0556267024538637,1.0732407404244593,3.1932773825817127,3.1941406278970792,1.6934818939315688,0.93367961982220049,2.8253917503284298]
["A free area","[m²]",{"$f":"((((PI()*VLOOKUP(C4,$B$14:$C$17,2,1)^2))/4)*C5)*10^-6","v":2.8484697125507377E-4},{"$f":"((((PI()*VLOOKUP(D4,$B$14:$C$17,2,1)^2))/4)*D5)*10^-6","v":3.8653965550714182E-4},{"$f":"((((PI()*VLOOKUP(E4,$B$14:$C$17,2,1)^2))/4)*E5)*10^-6","v":5.9098696008261003E-4},8.4384062012736233E-4,4.6796288134762112E-4,6.3502943404744735E-4,9.7090714870714503E-4,1.3863095902092381E-3,5.2900151804513682E-4,7.1785936022754912E-4,1.0975472115819899E-3,1.5671325802365302E-3,5.9004015474265273E-4,8.00689286407651E-4,1.2241872744568351E-3,1.7479555702638219E-3,6.5107879144016853E-4,8.8351921258775278E-4,1.3508273373316801E-3,1.928778560291114E-3,8.3419470153271594E-4,1.1320089911280584E-3,1.7307475259562151E-3,2.4712475303729897E-3,1.0173106116252632E-3,1.3804987696683637E-3,2.1106677145807501E-3,3.0137165004548655E-3,1.2004265217178105E-3,1.6289885482086693E-3,2.4905879032052851E-3,3.5561854705367414E-3,1.3835424318103581E-3,1.8774783267489746E-3,2.8705080918298201E-3,4.0986544406186173E-3,1.5666583419029054E-3,2.1259681052892801E-3,3.2504282804543551E-3,4.6411234107004932E-3,1.7090818275304423E-3,2.3192379330428509E-3,3.54592176049566E-3,5.0630437207641737E-3]
["Lw total","[dBA]",{"$f":"10*LOG(C5*10^(C7/10))","v":{"$error":"#NUM!"}},{"$f":"10*LOG(D5*10^(D7/10))","v":{"$error":"#NUM!"}},{"$f":"10*LOG(E5*10^(E7/10))","v":1999.0021091541998},61.798061437979172,{"$error":"#NUM!"},499.86973427709086,70.977428410823549,36.901596411281311,1681.3482506691937,213.9613940782809,45.654262664423854,33.732227513012674,669.50242065247016,114.15250383627409,34.708380820360567,31.520225737862862,322.45684069027703,72.162958453891846,29.323976733922393,29.927802907350006,79.625025430837979,34.977664648272466,23.795638739518814,27.200890049768471,41.504253733091033,27.216472814905615,22.646868870520755,25.973219914659854,31.200051787437097,24.897787214793837,22.506072957965728,25.398360624112314,27.514388658446745,{"$f":"10*LOG(AJ5*10^(AJ7/10))","v":24.131896644925153},22.674400339365306,25.146543480278268,25.996865591145109,23.930833910818492,22.948447948789092,25.068484590946344,25.447233445155707,23.946574711190198,23.186772437080826,25.078484567587061]
["Ps [Pa]","[Pa]",{"$f":"($C$20/(C5*C11))^2","v":5025.6200031262979},{"$f":"($C$20/(D5*D11))^2","v":3010.5069876195603},1280.5092250201239,628.04367315437946,1862.0444624059628,1115.4241390802154,474.44198129290032,232.69671065833336,1457.1324269419447,872.86888990152943,371.27190547920753,182.09550286724607,1171.2503217749756,701.61637285782865,298.43021177639031,146.36927459959375,961.93507872339296,576.22985309905653,245.0974688515081,120.21148431470543,585.97353992430385,351.01687660525516,149.30387156689133,73.228173669398174,394.00860824510187,236.02374782937358,100.39192324157771,49.238623975303348,282.97084763365547,169.50858074502551,72.099916145919067,35.362413081947246,213.02368525362343,127.60799514996408,54.2776401608876,26.621228360349996,166.13619845045619,99.520892152712733,42.330883471739625,20.761774319153037,139.60055564239718,83.625194100543354,35.569700695003441,17.445657587621646]
["c/nozzle",null,{"$f":"HLOOKUP(C4,$N$13:$Q$14,2,1)","v":4.3527215672634449E-2},{"$f":"HLOOKUP(D4,$N$13:$Q$14,2,1)","v":5.6238780062027545E-2},8.6231185216168807E-2,0.12312912370751333,4.3527215672634449E-2,5.6238780062027545E-2,8.6231185216168807E-2,0.12312912370751333,4.3527215672634449E-2,5.6238780062027545E-2,8.6231185216168807E-2,0.12312912370751333,4.3527215672634449E-2,5.6238780062027545E-2,8.6231185216168807E-2,0.12312912370751333,4.3527215672634449E-2,5.6238780062027545E-2,8.6231185216168807E-2,0.12312912370751333,4.3527215672634449E-2,5.6238780062027545E-2,8.6231185216168807E-2,0.12312912370751333,4.3527215672634449E-2,5.6238780062027545E-2,8.6231185216168807E-2,0.12312912370751333,4.3527215672634449E-2,5.6238780062027545E-2,8.6231185216168807E-2,0.12312912370751333,4.3527215672634449E-2,5.6238780062027545E-2,8.6231185216168807E-2,0.12312912370751333,4.3527215672634449E-2,5.6238780062027545E-2,8.6231185216168807E-2,0.12312912370751333,4.3527215672634449E-2,5.6238780062027545E-2,8.6231185216168807E-2,0.12312912370751333]
[]
[null,null,"Ø [mm]","factor a","factor b","factor C",null,null,null,null,null,null,"factor","A","B ","C","D"]
["Ø nozle","A",3.5990000000000002,0.19339999999999999,0.19969999999999999,null,null,null,"Ps max",180,null,null,"c-waarde 1 nozzle",4.3527215672634449E-2,5.6238780062027545E-2,8.6231185216168807E-2,0.12312912370751333]
[null,"B",4.1924999999999999,0.2009,0.20599999999999999,null,null,null,"Ps min",20]
[null,"C",5.1840000000000011,0.20169999999999999,0.22639999999999999]
[null,"D",6.1945000000000006,4.3999999999999997E-2,0.41760000000000003,-0.14280000000000001]
[]
[]
["Q prim cooling","m³/h",{"$f":"capacity!B4","v":86.4}]
[null,null,null,null,null,null,null,null,null,null,null,null,null,null,null,null,"A nozzle",null,null,null,null,null,null,null,null,null,"C nozzle"]
["B nozzle",null,null,null,null,null,null,null,"D nozzle",null,null,null,null,null,null,null,"nozzle v[m/s]","Lw/nozzle [dB(A)]",null,null,null,null,null,null,null,null,"nozzle v[m/s]","Lw/nozzle [dB(A)]"]
["nozzle v[m/s]","Lw/nozzle [dB(A)]",null,"Lw trendl","fout [%]",null,0.2009,null,"nozzle v[m/s]","Lw/nozzle [dB(A)]",null,null,null,null,null,null,0,0.2,null,null,null,null,null,null,null,null,0,0.2]
[0,0.2,null,{"$f":"$G$23*EXP($G$24*A24)","v":0.2009},{"$f":"(B24-D24)/(B24/100)","v":-0.44999999999999207},null,0.20599999999999999,null,0,0.2,null,null,null,null,null,null,14.112792503437152,3.4888269160354883,null,null,null,null,null,null,null,null,13.746605753605255,6.1576267694997879]
[13.111033514222125,3.6535523377668468,null,{"$f":"$G$23*EXP($G$24*A25)","v":2.9919486477162747},{"$f":"(B25-D25)/(B25/100)","v":18.108504515223746},null,null,null,9.7258547113791227,7.0043857277812869,null,null,null,null,null,null,15.959648529440312,6.1143828058806493,null,null,null,null,null,null,null,null,15.805329366294872,10.522079983105936]
[15.00441210788251,5.833741128313533,null,{"$f":"$G$23*EXP($G$24*A26)","v":4.4192097347557882},{"$f":"(B26-D26)/(B26/100)","v":24.247414522602746},null,null,null,11.291301082480532,11.621549740928799,null,null,null,null,null,null,18.705644939565637,12.141497182344494,null,null,null,null,null,null,null,null,17.441908164807543,14.484640752972366]
[18.423407579578129,11.990747237615487,null,{"$f":"$G$23*EXP($G$24*A27)","v":8.9376612894725724},{"$f":"(B27-D27)/(B27/100)","v":25.462015732974951},null,null,null,13.037741249546158,16.230753680145039]
[null,null,null,null,null,null,null,null,15.361917663867738,21.120710773013979]
["Ø [mm]",4.1924999999999999,null,null,null,null,null,null,18.874294754872231,26.385855652045027]
[]
[null,null,null,null,null,null,null,null,"Ø [mm]",6.1945000000000006]
[]
[]
[]
[]
[]
[]
[]
[]
[]
[]
[]
[]
[]
[]
[]
[]
[]
[]
["HEATING"]
[]
["length beam","[mm]",600,600,600,600,900,900,900,900,1000,1000,1000,1000,1100,1100,1100,1100,1200,1200,1200,1200,1500,1500,1500,1500,1800,1800,1800,1800,2100,2100,2100,2100,2400,2400,2400,2400,2700,2700,2700,2700,2950,2950,2950,2950]
["nozzle","[]","A","B ","C","D","A","B ","C","D","A","B ","C","D","A","B ","C","D","A","B ","C","D","A","B ","C","D","A","B ","C","D","A","B ","C","D","A","B ","C","D","A","B ","C","D","A","B ","C","D"]
["no nozzles","[]",{"$f":"capacity!J14","v":28},{"$f":"capacity!K14","v":28},{"$f":"capacity!L14","v":28},{"$f":"capacity!M14","v":28},{"$f":"capacity!N14","v":46},{"$f":"capacity!O14","v":46},{"$f":"capacity!P14","v":46},{"$f":"capacity!Q14","v":46},{"$f":"capacity!R14","v":52},{"$f":"capacity!S14","v":52},{"$f":"capacity!T14","v":52},{"$f":"capacity!U14","v":52},{"$f":"capacity!V14","v":58},{"$f":"capacity!W14","v":58},{"$f":"capacity!X14","v":58},{"$f":"capacity!Y14","v":58},{"$f":"capacity!Z14","v":64},{"$f":"capacity!AA14","v":64},{"$f":"capacity!AB14","v":64},{"$f":"capacity!AC14","v":64},{"$f":"capacity!AD14","v":82},{"$f":"capacity!AE14","v":82},{"$f":"capacity!AF14","v":82},{"$f":"capacity!AG14","v":82},{"$f":"capacity!AH14","v":100},{"$f":"capacity!AI14","v":100},{"$f":"capacity!AJ14","v":100},{"$f":"capacity!AK14","v":100},{"$f":"capacity!AL14","v":118},{"$f":"capacity!AM14","v":118},{"$f":"capacity!AN14","v":118},{"$f":"capacity!AO14","v":118},{"$f":"capacity!AP14","v":136},{"$f":"capacity!AQ14","v":136},{"$f":"capacity!AR14","v":136},{"$f":"capacity!AS14","v":136},{"$f":"capacity!AT14","v":154},{"$f":"capacity!AU14","v":154},{"$f":"capacity!AV14","v":154},{"$f":"capacity!AW14","v":154},{"$f":"capacity!AX14","v":168},{"$f":"capacity!AY14","v":168},{"$f":"capacity!AZ14","v":168},{"$f":"capacity!BA14","v":168}]
["nozzle v","[m/s]",{"$f":"($C$69/3600)/C57","v":84.255766857034843},{"$f":"($C$69/3600)/D57","v":62.089360452582518},40.610033082024692,28.44138979275214,51.286118956456001,37.793523753745873,24.719150571667207,17.31215030863174,45.368489846095699,33.432732551390586,21.86694089032099,15.314594503789614,40.675197793051311,29.974174011591554,19.604843556839505,13.730326106845862,36.861897999952745,27.164095198004848,17.766889473385802,12.443108034329061,28.770261853621655,21.201245032589146,13.866840564593797,9.7116940755739023,23.591614719969762,17.385020926723104,11.370809262966914,7.9635891419705995,19.992893830482849,14.73306858196873,9.6362790364126401,6.7488043576022028,17.346775529389529,12.783103622590518,8.3608891639462612,5.8555802514489699,15.319230337642702,11.288974627742276,7.3836423785499443,5.1711617805003893,14.042627809505809,10.348226742097086,6.7683388470041157,4.740231632125357]
["Lw/nozzle ","[dB(A)]/nozzle",{"$f":"IF(C53<>\"D\",VLOOKUP(C53,$B$14:$D$17,3,1)*EXP(VLOOKUP(C53,$B$14:$E$17,4,1)*C55),$D$17*C55^2+$E$17*C55+$F$17)","v":3925019.7670887299},{"$f":"IF(D53<>\"D\",VLOOKUP(D53,$B$14:$D$17,3,1)*EXP(VLOOKUP(D53,$B$14:$E$17,4,1)*D55),$D$17*D55^2+$E$17*D55+$F$17)","v":72074.835926072657},1984.5305288407774,47.326481124556977,5425.3802040096034,483.24215596027511,54.349850094007806,20.274018094465568,1664.1882172328455,196.80136064193289,28.494229228075859,16.572194076664676,651.86814071684068,96.518223900644713,17.074100884731191,13.885945802233486,304.3950409504381,54.101158714052978,11.262176994083518,11.866003167511131,60.486886907000809,15.839526124435299,4.6575002156816483,8.0627515259313007,21.50425373309103,7.2164728149056119,2.6468688705207568,5.9732199146598512,10.481231714375838,4.1789671417325813,1.787252884904474,4.679540551051061,6.1789995747445703,2.7965075612229771,1.3390112556631331,3.8111543965760939,4.1216583827804776,2.0556267024538637,1.0732407404244593,3.1932773825817127,3.1941406278970792,1.6934818939315688,0.93367961982220049,2.8253917503284298]
["A free area","[m²]",{"$f":"((((PI()*VLOOKUP(C53,$B$14:$C$17,2,1)^2))/4)*C54)*10^-6","v":2.8484697125507377E-4},{"$f":"((((PI()*VLOOKUP(D53,$B$14:$C$17,2,1)^2))/4)*D54)*10^-6","v":3.8653965550714182E-4},{"$f":"((((PI()*VLOOKUP(E53,$B$14:$C$17,2,1)^2))/4)*E54)*10^-6","v":5.9098696008261003E-4},8.4384062012736233E-4,4.6796288134762112E-4,6.3502943404744735E-4,9.7090714870714503E-4,1.3863095902092381E-3,5.2900151804513682E-4,7.1785936022754912E-4,1.0975472115819899E-3,1.5671325802365302E-3,5.9004015474265273E-4,8.00689286407651E-4,1.2241872744568351E-3,1.7479555702638219E-3,6.5107879144016853E-4,8.8351921258775278E-4,1.3508273373316801E-3,1.928778560291114E-3,8.3419470153271594E-4,1.1320089911280584E-3,1.7307475259562151E-3,2.4712475303729897E-3,1.0173106116252632E-3,1.3804987696683637E-3,2.1106677145807501E-3,3.0137165004548655E-3,1.2004265217178105E-3,1.6289885482086693E-3,2.4905879032052851E-3,3.5561854705367414E-3,1.3835424318103581E-3,1.8774783267489746E-3,2.8705080918298201E-3,4.0986544406186173E-3,1.5666583419029054E-3,2.1259681052892801E-3,3.2504282804543551E-3,4.6411234107004932E-3,1.7090818275304423E-3,2.3192379330428509E-3,3.54592176049566E-3,5.0630437207641737E-3]
["Lw total","[dBA]",{"$f":"IF(selection!$B$20<>\"E\",10*LOG(C54*10^(C56/10)),0)","v":{"$error":"#NUM!"}},{"$f":"IF(selection!$B$20<>\"E\",10*LOG(D54*10^(D56/10)),0)","v":{"$error":"#NUM!"}},{"$f":"IF(selection!$B$20<>\"E\",10*LOG(E54*10^(E56/10)),0)","v":1999.0021091541998},{"$f":"IF(selection!$B$20<>\"E\",10*LOG(F54*10^(F56/10)),0)","v":61.798061437979172},{"$f":"IF(selection!$B$20<>\"E\",10*LOG(G54*10^(G56/10)),0)","v":{"$error":"#NUM!"}},{"$f":"IF(selection!$B$20<>\"E\",10*LOG(H54*10^(H56/10)),0)","v":499.86973427709086},{"$f":"IF(selection!$B$20<>\"E\",10*LOG(I54*10^(I56/10)),0)","v":70.977428410823549},{"$f":"IF(selection!$B$20<>\"E\",10*LOG(J54*10^(J56/10)),0)","v":36.901596411281311},{"$f":"IF(selection!$B$20<>\"E\",10*LOG(K54*10^(K56/10)),0)","v":1681.3482506691937},{"$f":"IF(selection!$B$20<>\"E\",10*LOG(L54*10^(L56/10)),0)","v":213.9613940782809},{"$f":"IF(selection!$B$20<>\"E\",10*LOG(M54*10^(M56/10)),0)","v":45.654262664423854},{"$f":"IF(selection!$B$20<>\"E\",10*LOG(N54*10^(N56/10)),0)","v":33.732227513012674},{"$f":"IF(selection!$B$20<>\"E\",10*LOG(O54*10^(O56/10)),0)","v":669.50242065247016},{"$f":"IF(selection!$B$20<>\"E\",10*LOG(P54*10^(P56/10)),0)","v":114.15250383627409},{"$f":"IF(selection!$B$20<>\"E\",10*LOG(Q54*10^(Q56/10)),0)","v":34.708380820360567},{"$f":"IF(selection!$B$20<>\"E\",10*LOG(R54*10^(R56/10)),0)","v":31.520225737862862},{"$f":"IF(selection!$B$20<>\"E\",10*LOG(S54*10^(S56/10)),0)","v":322.45684069027703},{"$f":"IF(selection!$B$20<>\"E\",10*LOG(T54*10^(T56/10)),0)","v":72.162958453891846},{"$f":"IF(selection!$B$20<>\"E\",10*LOG(U54*10^(U56/10)),0)","v":29.323976733922393},{"$f":"IF(selection!$B$20<>\"E\",10*LOG(V54*10^(V56/10)),0)","v":29.927802907350006},{"$f":"IF(selection!$B$20<>\"E\",10*LOG(W54*10^(W56/10)),0)","v":79.625025430837979},{"$f":"IF(selection!$B$20<>\"E\",10*LOG(X54*10^(X56/10)),0)","v":34.977664648272466},{"$f":"IF(selection!$B$20<>\"E\",10*LOG(Y54*10^(Y56/10)),0)","v":23.795638739518814},{"$f":"IF(selection!$B$20<>\"E\",10*LOG(Z54*10^(Z56/10)),0)","v":27.200890049768471},{"$f":"IF(selection!$B$20<>\"E\",10*LOG(AA54*10^(AA56/10)),0)","v":41.504253733091033},{"$f":"IF(selection!$B$20<>\"E\",10*LOG(AB54*10^(AB56/10)),0)","v":27.216472814905615},{"$f":"IF(selection!$B$20<>\"E\",10*LOG(AC54*10^(AC56/10)),0)","v":22.646868870520755},{"$f":"IF(selection!$B$20<>\"E\",10*LOG(AD54*10^(AD56/10)),0)","v":25.973219914659854},{"$f":"IF(selection!$B$20<>\"E\",10*LOG(AE54*10^(AE56/10)),0)","v":31.200051787437097},{"$f":"IF(selection!$B$20<>\"E\",10*LOG(AF54*10^(AF56/10)),0)","v":24.897787214793837},{"$f":"IF(selection!$B$20<>\"E\",10*LOG(AG54*10^(AG56/10)),0)","v":22.506072957965728},{"$f":"IF(selection!$B$20<>\"E\",10*LOG(AH54*10^(AH56/10)),0)","v":25.398360624112314},{"$f":"IF(selection!$B$20<>\"E\",10*LOG(AI54*10^(AI56/10)),0)","v":27.514388658446745},{"$f":"IF(selection!$B$20<>\"E\",10*LOG(AJ54*10^(AJ56/10)),0)","v":24.131896644925153},{"$f":"IF(selection!$B$20<>\"E\",10*LOG(AK54*10^(AK56/10)),0)","v":22.674400339365306},{"$f":"IF(selection!$B$20<>\"E\",10*LOG(AL54*10^(AL56/10)),0)","v":25.146543480278268},{"$f":"IF(selection!$B$20<>\"E\",10*LOG(AM54*10^(AM56/10)),0)","v":25.996865591145109},{"$f":"IF(selection!$B$20<>\"E\",10*LOG(AN54*10^(AN56/10)),0)","v":23.930833910818492},{"$f":"IF(selection!$B$20<>\"E\",10*LOG(AO54*10^(AO56/10)),0)","v":22.948447948789092},{"$f":"IF(selection!$B$20<>\"E\",10*LOG(AP54*10^(AP56/10)),0)","v":25.068484590946344},{"$f":"IF(selection!$B$20<>\"E\",10*LOG(AQ54*10^(AQ56/10)),0)","v":25.447233445155707},{"$f":"IF(selection!$B$20<>\"E\",10*LOG(AR54*10^(AR56/10)),0)","v":23.946574711190198},{"$f":"IF(selection!$B$20<>\"E\",10*LOG(AS54*10^(AS56/10)),0)","v":23.186772437080826},{"$f":"IF(selection!$B$20<>\"E\",10*LOG(AT54*10^(AT56/10)),0)","v":25.078484567587061}]
["Ps [Pa]","[Pa]",{"$f":"($C$69/(C54*C60))^2","v":5025.6200031262979},{"$f":"($C$69/(D54*D60))^2","v":3010.5069876195603},1280.5092250201239,628.04367315437946,1862.0444624059628,1115.4241390802154,474.44198129290032,232.69671065833336,1457.1324269419447,872.86888990152943,371.27190547920753,182.09550286724607,1171.2503217749756,701.61637285782865,298.43021177639031,146.36927459959375,961.93507872339296,576.22985309905653,245.0974688515081,120.21148431470543,585.97353992430385,351.01687660525516,149.30387156689133,73.228173669398174,394.00860824510187,236.02374782937358,100.39192324157771,49.238623975303348,282.97084763365547,169.50858074502551,72.099916145919067,35.362413081947246,213.02368525362343,127.60799514996408,54.2776401608876,26.621228360349996,166.13619845045619,99.520892152712733,42.330883471739625,20.761774319153037,139.60055564239718,83.625194100543354,35.569700695003441,17.445657587621646]
["c/nozzle",null,{"$f":"HLOOKUP(C53,$N$13:$Q$14,2,1)","v":4.3527215672634449E-2},{"$f":"HLOOKUP(D53,$N$13:$Q$14,2,1)","v":5.6238780062027545E-2},8.6231185216168807E-2,0.12312912370751333,4.3527215672634449E-2,5.6238780062027545E-2,8.6231185216168807E-2,0.12312912370751333,4.3527215672634449E-2,5.6238780062027545E-2,8.6231185216168807E-2,0.12312912370751333,4.3527215672634449E-2,5.6238780062027545E-2,8.6231185216168807E-2,0.12312912370751333,4.3527215672634449E-2,5.6238780062027545E-2,8.6231185216168807E-2,0.12312912370751333,4.3527215672634449E-2,5.6238780062027545E-2,8.6231185216168807E-2,0.12312912370751333,4.3527215672634449E-2,5.6238780062027545E-2,8.6231185216168807E-2,0.12312912370751333,4.3527215672634449E-2,5.6238780062027545E-2,8.6231185216168807E-2,0.12312912370751333,4.3527215672634449E-2,5.6238780062027545E-2,8.6231185216168807E-2,0.12312912370751333,4.3527215672634449E-2,5.6238780062027545E-2,8.6231185216168807E-2,0.12312912370751333,4.3527215672634449E-2,5.6238780062027545E-2,8.6231185216168807E-2,0.12312912370751333]
[]
[null,null,"Ø [mm]","factor a","factor b","factor C",null,null,null,null,null,null,"factor","A","B ","C","D"]
["Ø nozle","A",3.5990000000000002,0.19339999999999999,0.19969999999999999,null,null,null,"Ps max",180,null,null,"c-waarde 1 nozzle",4.3527215672634449E-2,5.6238780062027545E-2,8.6231185216168807E-2,0.12312912370751333]
[null,"B",4.1924999999999999,0.2009,0.20599999999999999,null,null,null,"Ps min",20]
[null,"C",5.1840000000000011,0.20169999999999999,0.22639999999999999]
[null,"D",6.1945000000000006,4.3999999999999997E-2,0.41760000000000003,-0.14280000000000001]
[]
[]
["Qair pri heating","m³/h",{"$f":"capacity!C4","v":86.4}]

{"sheet":"capacity","index":10,"n_rows":109,"n_cols":53,"rows_kept":109,"cut":false,"hidden":true,"merged":[[0,0,0,2],[4,9,4,12],[33,0,33,1],[52,6,71,6],[23,1,23,3],[10,1,10,4],[22,0,22,3],[22,6,47,6],[15,0,15,3],[9,0,9,4],[9,6,18,6],[78,6,103,6],[1,12,1,13],[4,45,4,48],[4,49,4,52],[4,25,4,28],[4,29,4,32],[4,33,4,36],[4,37,4,40],[4,41,4,44],[4,13,4,16],[4,17,4,20],[4,21,4,24]]}
["INPUT DATA",null,null,null,null,null,{"$f":"IF(O2=\"Two pipe\",\"C\",\"H\")","v":"H"},null,null,null,"Four pipe",null,null,null,null,null,null,"Yes"]
[null,"cooling","heating",null,null,null,{"$f":"G1","v":"H"},"dit word \"E\" als de mat er is",null,null,"Two pipe",null,"geselecteerd systeem",null,{"$f":"selection!B17","v":"Four pipe"},null,null,"No"]
["Room air temperature",{"$f":"selection!B12","v":25},{"$f":"selection!C12","v":20},"ºC",null,null,null,null,null,null,"type of system",null,null,null,null,null,null,"electrical film"]
["Supply (primary) air flow rate",{"$f":"selection!B13","v":86.4},{"$f":"selection!C13","v":86.4},"m3/h",null,null,"type battery"]
["Supply (primary) air temperature",{"$f":"selection!B14","v":20},{"$f":"selection!C14","v":20},"ºC",null,null,null,null,null,600,null,null,null,900,null,null,null,1000,null,null,null,1100,null,null,null,1200,1560,1630,1700,1500,1840,1910,1980,1800,2120,2190,2260,2100,null,null,null,2400,2470,2540,2610,2700,2750,2820,2890,2950,3030,3100,3170]
["Inlet water temperature",{"$f":"selection!B15","v":14},{"$f":"selection!C15","v":45},"ºC"]
["Cooling water flow rate",{"$f":"selection!B16","v":100},{"$f":"selection!C16","v":100},"l/h",null,null,null,"length beam","[mm]",600,600,600,600,900,900,900,900,1000,1000,1000,1000,1100,1100,1100,1100,1200,1200,1200,1200,1500,1500,1500,1500,1800,1800,1800,1800,2100,2100,2100,2100,2400,2400,2400,2400,2700,2700,2700,2700,2950,2950,2950,2950]
["cooling/cooling&heating",{"$f":"IF(selection!B20=\"yes\",\"E\",IF(selection!B17=\"Two pipe\",\"C\",\"H\"))","v":"H"},{"$f":"B8","v":"H"},"[]",null,null,null,"nozzle","[]","A","B ","C","D","A","B ","C","D","A","B ","C","D","A","B ","C","D","A","B ","C","D","A","B ","C","D","A","B ","C","D","A","B ","C","D","A","B ","C","D","A","B ","C","D","A","B ","C","D"]
[]
["Induction and pressuredrop",null,null,null,null,null,"Air ","a (inductie)","[]",{"$f":"HLOOKUP(J8,$B$12:$E$14,2,1)","v":6.5596735762048679},5.4554150895801721,4.29388961157444,3.504102900721441,6.5596735762048679,5.4554150895801721,4.29388961157444,3.504102900721441,6.5596735762048679,5.4554150895801721,4.29388961157444,3.504102900721441,6.5596735762048679,5.4554150895801721,4.29388961157444,3.504102900721441,6.5596735762048679,5.4554150895801721,4.29388961157444,3.504102900721441,6.5596735762048679,5.4554150895801721,4.29388961157444,3.504102900721441,6.5596735762048679,5.4554150895801721,4.29388961157444,3.504102900721441,6.5596735762048679,5.4554150895801721,4.29388961157444,3.504102900721441,6.5596735762048679,5.4554150895801721,4.29388961157444,3.504102900721441,6.5596735762048679,5.4554150895801721,4.29388961157444,3.504102900721441,6.5596735762048679,5.4554150895801721,4.29388961157444,3.504102900721441]
[null,"Nozzle",null,null,null,null,null,"Q air primair","[m³/s]",{"$f":"$B$4/3600","v":2.4E-2},{"$f":"$B$4/3600","v":2.4E-2},2.4E-2,2.4E-2,2.4E-2,2.4E-2,2.4E-2,2.4E-2,2.4E-2,2.4E-2,2.4E-2,2.4E-2,2.4E-2,2.4E-2,2.4E-2,2.4E-2,2.4E-2,2.4E-2,2.4E-2,2.4E-2,2.4E-2,2.4E-2,2.4E-2,2.4E-2,2.4E-2,2.4E-2,2.4E-2,2.4E-2,2.4E-2,2.4E-2,2.4E-2,2.4E-2,2.4E-2,2.4E-2,2.4E-2,2.4E-2,2.4E-2,2.4E-2,2.4E-2,2.4E-2,2.4E-2,2.4E-2,2.4E-2,2.4E-2]
["factor","A","B ","C","D",null,null,"Q air secundair","[m³/s]",{"$f":"J10*J11","v":0.15743216582891684},{"$f":"K10*K11","v":0.13092996214992414},{"$f":"L10*L11","v":0.10305335067778656},8.4098469617314583E-2,0.15743216582891684,0.13092996214992414,0.10305335067778656,8.4098469617314583E-2,0.15743216582891684,0.13092996214992414,0.10305335067778656,8.4098469617314583E-2,0.15743216582891684,0.13092996214992414,0.10305335067778656,8.4098469617314583E-2,0.15743216582891684,0.13092996214992414,0.10305335067778656,8.4098469617314583E-2,0.15743216582891684,0.13092996214992414,0.10305335067778656,8.4098469617314583E-2,0.15743216582891684,0.13092996214992414,0.10305335067778656,8.4098469617314583E-2,0.15743216582891684,0.13092996214992414,0.10305335067778656,8.4098469617314583E-2,0.15743216582891684,0.13092996214992414,0.10305335067778656,8.4098469617314583E-2,0.15743216582891684,0.13092996214992414,0.10305335067778656,8.4098469617314583E-2,0.15743216582891684,0.13092996214992414,0.10305335067778656,8.4098469617314583E-2]
["a (inductie)",6.5596735762048679,5.4554150895801721,4.29388961157444,3.504102900721441,null,null,"Qair total /meter","[m³/hm]",{"$f":"((J11+J12)*3600)/((J7-115)/1000)","v":1346.7129834723723},1149.9955953396432,943.07641740212705,802.38039303573714,832.04560125363128,710.50683278946099,582.66504769430776,495.73820461443631,738.02914913457687,630.22357484714905,516.82718919777585,439.72258827382205,663.10233196355387,566.24148603017954,464.35742379698644,395.08070113942387,601.98690966276547,514.05333063569299,421.55950455302457,358.66773329247235,471.59263320151666,402.70603880124685,330.24697649099755,280.97797156847111,387.6295531062911,331.0076342669002,271.44929521663596,230.95221995390654,329.04574155370301,280.98129155653749,230.42421281613682,196.04760232863097,285.84498773921246,244.09096881388484,200.1715809365565,170.30831099445624,252.67148819500989,215.76319680453651,176.94083653386136,150.54332325815571,230.39005184624358,196.73645987291954,161.33758816226864,137.26789792674867]
["c-waarde 1 nozzle",4.3527215672634449E-2,5.6238780062027545E-2,8.6231185216168807E-2,0.12312912370751333,null,null,"no nozzles","[]",28,28,28,28,46,46,46,46,52,52,52,52,58,58,58,58,64,64,64,64,82,82,82,82,100,100,100,100,118,118,118,118,136,136,136,136,154,154,154,154,168,168,168,168]
[null,null,null,null,null,null,null,"c-waarde 1 nozzle","[]",{"$f":"HLOOKUP(J8,$B$12:$E$14,3,1)","v":4.3527215672634449E-2},5.6238780062027545E-2,8.6231185216168807E-2,0.12312912370751333,4.3527215672634449E-2,5.6238780062027545E-2,8.6231185216168807E-2,0.12312912370751333,4.3527215672634449E-2,5.6238780062027545E-2,8.6231185216168807E-2,0.12312912370751333,4.3527215672634449E-2,5.6238780062027545E-2,8.6231185216168807E-2,0.12312912370751333,4.3527215672634449E-2,5.6238780062027545E-2,8.6231185216168807E-2,0.12312912370751333,4.3527215672634449E-2,5.6238780062027545E-2,8.6231185216168807E-2,0.12312912370751333,4.3527215672634449E-2,5.6238780062027545E-2,8.6231185216168807E-2,0.12312912370751333,4.3527215672634449E-2,5.6238780062027545E-2,8.6231185216168807E-2,0.12312912370751333,4.3527215672634449E-2,5.6238780062027545E-2,8.6231185216168807E-2,0.12312912370751333,4.3527215672634449E-2,5.6238780062027545E-2,8.6231185216168807E-2,0.12312912370751333,4.3527215672634449E-2,5.6238780062027545E-2,8.6231185216168807E-2,0.12312912370751333]
["physical parameters",null,null,null,null,null,null,"Ps plenum pressure","[Pa]",{"$f":"($B$4/(J14*J15))^2","v":5025.6200031262979},{"$f":"($B$4/(K14*K15))^2","v":3010.5069876195603},1280.5092250201239,628.04367315437946,1862.0444624059628,1115.4241390802154,474.44198129290032,232.69671065833336,1457.1324269419447,872.86888990152943,371.27190547920753,182.09550286724607,1171.2503217749756,701.61637285782865,298.43021177639031,146.36927459959375,961.93507872339296,576.22985309905653,245.0974688515081,120.21148431470543,585.97353992430385,351.01687660525516,149.30387156689133,73.228173669398174,394.00860824510187,236.02374782937358,100.39192324157771,49.238623975303348,282.97084763365547,169.50858074502551,72.099916145919067,35.362413081947246,213.02368525362343,127.60799514996408,54.2776401608876,26.621228360349996,166.13619845045619,99.520892152712733,42.330883471739625,20.761774319153037,139.60055564239718,83.625194100543354,35.569700695003441,17.445657587621646]
[null,"cooling","heating",null,null,null,null,"Ca","[W/°C]",{"$f":"J12*$B$19*$B$21","v":186.29764512807276},{"$f":"K12*$B$19*$B$21","v":154.9362133005624},121.94837346449538,99.518079841487733,186.29764512807276,154.9362133005624,121.94837346449538,99.518079841487733,186.29764512807276,154.9362133005624,121.94837346449538,99.518079841487733,186.29764512807276,154.9362133005624,121.94837346449538,99.518079841487733,186.29764512807276,{"$f":"AA12*$B$19*$B$21","v":154.9362133005624},121.94837346449538,99.518079841487733,186.29764512807276,154.9362133005624,121.94837346449538,99.518079841487733,186.29764512807276,154.9362133005624,121.94837346449538,99.518079841487733,186.29764512807276,154.9362133005624,121.94837346449538,99.518079841487733,186.29764512807276,154.9362133005624,121.94837346449538,99.518079841487733,186.29764512807276,154.9362133005624,121.94837346449538,99.518079841487733,186.29764512807276,154.9362133005624,121.94837346449538,99.518079841487733]
["ρw ",{"$f":"'physical parameters'!D111","v":999.33},{"$f":"'physical parameters'!E111","v":990.22},"[kg/m³]",null,null,null,"P air cooling","[W]",{"$f":"(($B$4*$B$19/3600)*$B$21*($B$3-$B$5))","v":142.00222233913064},{"$f":"(($B$4*$B$19/3600)*$B$21*($B$3-$B$5))","v":142.00222233913064},142.00222233913064,142.00222233913064,142.00222233913064,142.00222233913064,142.00222233913064,142.00222233913064,142.00222233913064,142.00222233913064,142.00222233913064,142.00222233913064,142.00222233913064,142.00222233913064,142.00222233913064,142.00222233913064,142.00222233913064,142.00222233913064,142.00222233913064,142.00222233913064,142.00222233913064,142.00222233913064,142.00222233913064,142.00222233913064,142.00222233913064,142.00222233913064,142.00222233913064,142.00222233913064,142.00222233913064,142.00222233913064,142.00222233913064,142.00222233913064,142.00222233913064,142.00222233913064,142.00222233913064,142.00222233913064,142.00222233913064,142.00222233913064,142.00222233913064,142.00222233913064,142.00222233913064,142.00222233913064,142.00222233913064,142.00222233913064]
["ρa ",{"$f":"'physical parameters'!D14","v":1.1775524072205275},{"$f":"'physical parameters'!E14","v":1.1976471581969872},"[kg/m³]",null,null,null,"length battery","[m]",{"$f":"(J7-145)/1000","v":0.45500000000000002},{"$f":"(K7-145)/1000","v":0.45500000000000002},{"$f":"(L7-145)/1000","v":0.45500000000000002},0.45500000000000002,0.755,0.755,0.755,0.755,0.85499999999999998,0.85499999999999998,0.85499999999999998,0.85499999999999998,0.95499999999999996,0.95499999999999996,0.95499999999999996,0.95499999999999996,1.0549999999999999,{"$f":"(AA7-145)/1000","v":1.0549999999999999},1.0549999999999999,1.0549999999999999,1.355,1.355,1.355,1.355,1.655,1.655,1.655,1.655,1.9550000000000001,1.9550000000000001,1.9550000000000001,1.9550000000000001,2.2549999999999999,2.2549999999999999,2.2549999999999999,2.2549999999999999,2.5550000000000002,2.5550000000000002,2.5550000000000002,2.5550000000000002,2.8050000000000002,2.8050000000000002,2.8050000000000002,2.8050000000000002]
["cw",{"$f":"'physical parameters'!D112*1000","v":4187},{"$f":"'physical parameters'!E112*1000","v":4180},"[J/kg/K]",null,null,null,"p air heating","[W]",{"$f":"IF(selection!$B$17=\"Four pipe\",($C$4/3600)*$C$19,0)*$C$21*($C$5-$C$3)","v":0},{"$f":"IF(selection!$B$17=\"Four pipe\",($C$4/3600)*$C$19,0)*$C$21*($C$5-$C$3)","v":0},{"$f":"IF(selection!$B$17=\"Four pipe\",($C$4/3600)*$C$19,0)*$C$21*($C$5-$C$3)","v":0},{"$f":"IF(selection!$B$17=\"Four pipe\",($C$4/3600)*$C$19,0)*$C$21*($C$5-$C$3)","v":0},{"$f":"IF(selection!$B$17=\"Four pipe\",($C$4/3600)*$C$19,0)*$C$21*($C$5-$C$3)","v":0},{"$f":"IF(selection!$B$17=\"Four pipe\",($C$4/3600)*$C$19,0)*$C$21*($C$5-$C$3)","v":0},{"$f":"IF(selection!$B$17=\"Four pipe\",($C$4/3600)*$C$19,0)*$C$21*($C$5-$C$3)","v":0},{"$f":"IF(selection!$B$17=\"Four pipe\",($C$4/3600)*$C$19,0)*$C$21*($C$5-$C$3)","v":0},{"$f":"IF(selection!$B$17=\"Four pipe\",($C$4/3600)*$C$19,0)*$C$21*($C$5-$C$3)","v":0},{"$f":"IF(selection!$B$17=\"Four pipe\",($C$4/3600)*$C$19,0)*$C$21*($C$5-$C$3)","v":0},{"$f":"IF(selection!$B$17=\"Four pipe\",($C$4/3600)*$C$19,0)*$C$21*($C$5-$C$3)","v":0},{"$f":"IF(selection!$B$17=\"Four pipe\",($C$4/3600)*$C$19,0)*$C$21*($C$5-$C$3)","v":0},{"$f":"IF(selection!$B$17=\"Four pipe\",($C$4/3600)*$C$19,0)*$C$21*($C$5-$C$3)","v":0},{"$f":"IF(selection!$B$17=\"Four pipe\",($C$4/3600)*$C$19,0)*$C$21*($C$5-$C$3)","v":0},{"$f":"IF(selection!$B$17=\"Four pipe\",($C$4/3600)*$C$19,0)*$C$21*($C$5-$C$3)","v":0},{"$f":"IF(selection!$B$17=\"Four pipe\",($C$4/3600)*$C$19,0)*$C$21*($C$5-$C$3)","v":0},{"$f":"IF(selection!$B$17=\"Four pipe\",($C$4/3600)*$C$19,0)*$C$21*($C$5-$C$3)","v":0},{"$f":"IF(selection!$B$17=\"Four pipe\",($C$4/3600)*$C$19,0)*$C$21*($C$5-$C$3)","v":0},{"$f":"IF(selection!$B$17=\"Four pipe\",($C$4/3600)*$C$19,0)*$C$21*($C$5-$C$3)","v":0},{"$f":"IF(selection!$B$17=\"Four pipe\",($C$4/3600)*$C$19,0)*$C$21*($C$5-$C$3)","v":0},{"$f":"IF(selection!$B$17=\"Four pipe\",($C$4/3600)*$C$19,0)*$C$21*($C$5-$C$3)","v":0},{"$f":"IF(selection!$B$17=\"Four pipe\",($C$4/3600)*$C$19,0)*$C$21*($C$5-$C$3)","v":0},{"$f":"IF(selection!$B$17=\"Four pipe\",($C$4/3600)*$C$19,0)*$C$21*($C$5-$C$3)","v":0},{"$f":"IF(selection!$B$17=\"Four pipe\",($C$4/3600)*$C$19,0)*$C$21*($C$5-$C$3)","v":0},{"$f":"IF(selection!$B$17=\"Four pipe\",($C$4/3600)*$C$19,0)*$C$21*($C$5-$C$3)","v":0},{"$f":"IF(selection!$B$17=\"Four pipe\",($C$4/3600)*$C$19,0)*$C$21*($C$5-$C$3)","v":0},{"$f":"IF(selection!$B$17=\"Four pipe\",($C$4/3600)*$C$19,0)*$C$21*($C$5-$C$3)","v":0},{"$f":"IF(selection!$B$17=\"Four pipe\",($C$4/3600)*$C$19,0)*$C$21*($C$5-$C$3)","v":0},{"$f":"IF(selection!$B$17=\"Four pipe\",($C$4/3600)*$C$19,0)*$C$21*($C$5-$C$3)","v":0},{"$f":"IF(selection!$B$17=\"Four pipe\",($C$4/3600)*$C$19,0)*$C$21*($C$5-$C$3)","v":0},{"$f":"IF(selection!$B$17=\"Four pipe\",($C$4/3600)*$C$19,0)*$C$21*($C$5-$C$3)","v":0},{"$f":"IF(selection!$B$17=\"Four pipe\",($C$4/3600)*$C$19,0)*$C$21*($C$5-$C$3)","v":0},{"$f":"IF(selection!$B$17=\"Four pipe\",($C$4/3600)*$C$19,0)*$C$21*($C$5-$C$3)","v":0},{"$f":"IF(selection!$B$17=\"Four pipe\",($C$4/3600)*$C$19,0)*$C$21*($C$5-$C$3)","v":0},{"$f":"IF(selection!$B$17=\"Four pipe\",($C$4/3600)*$C$19,0)*$C$21*($C$5-$C$3)","v":0},{"$f":"IF(selection!$B$17=\"Four pipe\",($C$4/3600)*$C$19,0)*$C$21*($C$5-$C$3)","v":0},{"$f":"IF(selection!$B$17=\"Four pipe\",($C$4/3600)*$C$19,0)*$C$21*($C$5-$C$3)","v":0},{"$f":"IF(selection!$B$17=\"Four pipe\",($C$4/3600)*$C$19,0)*$C$21*($C$5-$C$3)","v":0},{"$f":"IF(selection!$B$17=\"Four pipe\",($C$4/3600)*$C$19,0)*$C$21*($C$5-$C$3)","v":0},{"$f":"IF(selection!$B$17=\"Four pipe\",($C$4/3600)*$C$19,0)*$C$21*($C$5-$C$3)","v":0},{"$f":"IF(selection!$B$17=\"Four pipe\",($C$4/3600)*$C$19,0)*$C$21*($C$5-$C$3)","v":0},{"$f":"IF(selection!$B$17=\"Four pipe\",($C$4/3600)*$C$19,0)*$C$21*($C$5-$C$3)","v":0},{"$f":"IF(selection!$B$17=\"Four pipe\",($C$4/3600)*$C$19,0)*$C$21*($C$5-$C$3)","v":0},{"$f":"IF(selection!$B$17=\"Four pipe\",($C$4/3600)*$C$19,0)*$C$21*($C$5-$C$3)","v":0}]
["ca",{"$f":"'physical parameters'!D24*1000","v":1004.9250000000001},{"$f":"'physical parameters'!E24*1000","v":1004.6800000000001},"[J/kg/K]"]
[]
["cooling parameters",null,null,null,null,null,"cooling capcity","Qw","[m³/s]",{"$f":"($B$7/3600)/1000","v":2.7777777777777776E-5},{"$f":"($B$7/3600)/1000","v":2.7777777777777776E-5},2.7777777777777776E-5,2.7777777777777776E-5,2.7777777777777776E-5,2.7777777777777776E-5,2.7777777777777776E-5,2.7777777777777776E-5,2.7777777777777776E-5,2.7777777777777776E-5,2.7777777777777776E-5,2.7777777777777776E-5,2.7777777777777776E-5,2.7777777777777776E-5,2.7777777777777776E-5,2.7777777777777776E-5,2.7777777777777776E-5,2.7777777777777776E-5,2.7777777777777776E-5,2.7777777777777776E-5,2.7777777777777776E-5,2.7777777777777776E-5,2.7777777777777776E-5,2.7777777777777776E-5,2.7777777777777776E-5,2.7777777777777776E-5,2.7777777777777776E-5,2.7777777777777776E-5,2.7777777777777776E-5,2.7777777777777776E-5,2.7777777777777776E-5,2.7777777777777776E-5,2.7777777777777776E-5,2.7777777777777776E-5,2.7777777777777776E-5,2.7777777777777776E-5,2.7777777777777776E-5,2.7777777777777776E-5,2.7777777777777776E-5,2.7777777777777776E-5,2.7777777777777776E-5,2.7777777777777776E-5,2.7777777777777776E-5,2.7777777777777776E-5]
[null,"no circuit",null,null,null,null,null,"Cw","[W/°C]",{"$f":"J23*$B$18*$B$20","v":116.22763083333332},{"$f":"K23*$B$18*$B$20","v":116.22763083333332},116.22763083333332,116.22763083333332,116.22763083333332,116.22763083333332,116.22763083333332,116.22763083333332,116.22763083333332,116.22763083333332,116.22763083333332,116.22763083333332,116.22763083333332,116.22763083333332,116.22763083333332,116.22763083333332,116.22763083333332,116.22763083333332,116.22763083333332,116.22763083333332,116.22763083333332,116.22763083333332,116.22763083333332,116.22763083333332,116.22763083333332,116.22763083333332,116.22763083333332,116.22763083333332,116.22763083333332,116.22763083333332,116.22763083333332,116.22763083333332,116.22763083333332,116.22763083333332,116.22763083333332,116.22763083333332,116.22763083333332,116.22763083333332,116.22763083333332,116.22763083333332,116.22763083333332,116.22763083333332,116.22763083333332,116.22763083333332]
["parameter",1,2,4,null,null,null,"Cmin","[W/°C]",{"$f":"MIN(J24,J17)","v":116.22763083333332},{"$f":"MIN(K24,K17)","v":116.22763083333332},116.22763083333332,99.518079841487733,116.22763083333332,116.22763083333332,116.22763083333332,99.518079841487733,116.22763083333332,116.22763083333332,116.22763083333332,99.518079841487733,116.22763083333332,116.22763083333332,116.22763083333332,99.518079841487733,116.22763083333332,116.22763083333332,116.22763083333332,99.518079841487733,116.22763083333332,116.22763083333332,116.22763083333332,99.518079841487733,116.22763083333332,116.22763083333332,116.22763083333332,99.518079841487733,116.22763083333332,116.22763083333332,116.22763083333332,99.518079841487733,116.22763083333332,116.22763083333332,116.22763083333332,99.518079841487733,116.22763083333332,116.22763083333332,116.22763083333332,99.518079841487733,116.22763083333332,116.22763083333332,116.22763083333332,99.518079841487733]
["f0",1.2096634063457334,1.0987539721486828,null,null,null,null,"Cmin (lucht of water)","[]",{"$f":"IF(J25=J17,\"lucht\",\"water\")","v":"water"},{"$f":"IF(K25=K17,\"lucht\",\"water\")","v":"water"},"water","lucht","water","water","water","lucht","water","water","water","lucht","water","water","water","lucht","water","water","water","lucht","water","water","water","lucht","water","water","water","lucht","water","water","water","lucht","water","water","water","lucht","water","water","water","lucht","water","water","water","lucht"]
["f1",0.17097714280393719,0.82696530173597793,null,null,null,null,"no circuits","[]",{"$f":"IF(J7<=1100,1,IF(J7<=3000,2,4))","v":1},{"$f":"IF(K7<=1100,1,IF(K7<=3000,2,4))","v":1},1,1,1,1,1,1,1,1,1,1,1,1,1,1,2,2,2,2,2,2,2,2,2,2,2,2,2,2,2,2,2,2,2,2,2,2,2,2,2,2,2,2]
["m",2.5480720959916847,2.5927556853433948,null,null,null,null,"Type battery C /CH","[]",{"$f":"IF($B$8<>\"H\",$G$1,$G$2)","v":"H"},{"$f":"IF($B$8<>\"H\",$G$1,$G$2)","v":"H"},"H","H","H","H","H","H","H","H","H","H","H","H","H","H","H","H","H","H","H","H","H","H","H","H","H","H","H","H","H","H","H","H","H","H","H","H","H","H","H","H","H","H"]
["α",76.564076331921825,70.968356479109275,null,null,null,null,"L'","[]",{"$f":"J19*(J30/J31)","v":3.1850000000000001},{"$f":"K19*(K30/K31)","v":3.1850000000000001},3.1850000000000001,3.1850000000000001,5.2850000000000001,5.2850000000000001,5.2850000000000001,5.2850000000000001,5.9849999999999994,5.9849999999999994,5.9849999999999994,5.9849999999999994,6.6849999999999996,6.6849999999999996,6.6849999999999996,6.6849999999999996,7.3849999999999998,7.3849999999999998,7.3849999999999998,7.3849999999999998,9.4849999999999994,9.4849999999999994,9.4849999999999994,9.4849999999999994,11.585000000000001,11.585000000000001,11.585000000000001,11.585000000000001,13.685,13.685,13.685,13.685,15.785,15.785,15.785,15.785,17.885000000000002,17.885000000000002,17.885000000000002,17.885000000000002,19.635000000000002,19.635000000000002,19.635000000000002,19.635000000000002]
["β",1.5930874938891053,0.96918249928262645,null,null,null,null,"no tubes","[]",{"$f":"IF(J28<>\"H\",16,14)","v":14},{"$f":"IF(K28<>\"H\",16,14)","v":14},14,14,14,14,14,14,14,14,14,14,14,14,14,14,14,14,14,14,14,14,14,14,14,14,14,14,14,14,14,14,14,14,14,14,14,14,14,14,14,14,14,14]
["δ",6.9766037099815966E-3,1.7146800954750713E-2,null,null,null,null,"no rows","[]",2,2,2,2,2,2,2,2,2,2,2,2,2,2,2,2,2,2,2,2,2,2,2,2,2,2,2,2,2,2,2,2,2,2,2,2,2,2,2,2,2,2,2,2]
[null,null,null,null,null,null,null,"α","[]",{"$f":"IF(OR(J28=\"C\",J28=\"E\"),HLOOKUP(J27,$B$25:$D$31,5,1),HLOOKUP(J27,$B$25:$D$31,5,1)*HLOOKUP(J27,$B$25:$D$31,3,1))","v":13.090707012654546},{"$f":"IF(OR(K28=\"C\",K28=\"E\"),HLOOKUP(K27,$B$25:$D$31,5,1),HLOOKUP(K27,$B$25:$D$31,5,1)*HLOOKUP(K27,$B$25:$D$31,3,1))","v":13.090707012654546},13.090707012654546,13.090707012654546,13.090707012654546,13.090707012654546,13.090707012654546,13.090707012654546,13.090707012654546,13.090707012654546,13.090707012654546,13.090707012654546,13.090707012654546,13.090707012654546,13.090707012654546,13.090707012654546,58.688368329453048,58.688368329453048,58.688368329453048,58.688368329453048,58.688368329453048,58.688368329453048,58.688368329453048,58.688368329453048,58.688368329453048,58.688368329453048,58.688368329453048,58.688368329453048,58.688368329453048,58.688368329453048,58.688368329453048,58.688368329453048,58.688368329453048,58.688368329453048,58.688368329453048,58.688368329453048,58.688368329453048,58.688368329453048,58.688368329453048,58.688368329453048,58.688368329453048,58.688368329453048,58.688368329453048,58.688368329453048]
[null,null,null,null,null,null,null,"NTU","[m.°C/W]",{"$f":"(J32*J29)/J25","v":0.35872624724745911},{"$f":"(K32*K29)/K25","v":0.35872624724745911},0.35872624724745911,0.41895806170813105,0.59524904763039921,0.59524904763039921,0.59524904763039921,0.69519414635085486,0.67408998109137908,0.67408998109137908,0.67408998109137908,0.78727284123176267,0.75293091455235917,0.75293091455235917,0.75293091455235917,0.87935153611267058,3.7290065796360583,3.7290065796360583,3.7290065796360583,4.3551242226874898,4.7893875975420457,4.7893875975420457,4.7893875975420457,5.5935481722668694,5.8497686154480357,5.8497686154480357,5.8497686154480357,6.8319721218462517,6.9101496333540231,6.9101496333540231,6.9101496333540231,8.0703960714256322,7.9705306512600114,7.9705306512600114,7.9705306512600114,9.3088200210050136,9.0309116691660005,9.0309116691660005,9.0309116691660005,10.547243970584395,9.9145625174209915,9.9145625174209915,9.9145625174209915,11.579263928567213]
["heating parameters",null,null,null,null,null,null,"f1","[]",{"$f":"IF(OR(J28=\"C\",J28=\"E\"),1,HLOOKUP(J27,$B$25:$D$31,3,1))","v":0.17097714280393719},{"$f":"IF(OR(K28=\"C\",K28=\"E\"),1,HLOOKUP(K27,$B$25:$D$31,3,1))","v":0.17097714280393719},0.17097714280393719,0.17097714280393719,0.17097714280393719,0.17097714280393719,0.17097714280393719,0.17097714280393719,0.17097714280393719,0.17097714280393719,0.17097714280393719,0.17097714280393719,0.17097714280393719,0.17097714280393719,0.17097714280393719,0.17097714280393719,0.82696530173597793,0.82696530173597793,0.82696530173597793,0.82696530173597793,0.82696530173597793,0.82696530173597793,0.82696530173597793,0.82696530173597793,0.82696530173597793,0.82696530173597793,0.82696530173597793,0.82696530173597793,0.82696530173597793,0.82696530173597793,0.82696530173597793,0.82696530173597793,0.82696530173597793,0.82696530173597793,0.82696530173597793,0.82696530173597793,0.82696530173597793,0.82696530173597793,0.82696530173597793,0.82696530173597793,0.82696530173597793,0.82696530173597793,0.82696530173597793,0.82696530173597793]
["f0 ",1.0490999999999999,null,null,null,null,null,"δ","[]",{"$f":"HLOOKUP(J27,$B$25:$D$31,7,1)","v":6.9766037099815966E-3},{"$f":"HLOOKUP(K27,$B$25:$D$31,7,1)","v":6.9766037099815966E-3},6.9766037099815966E-3,6.9766037099815966E-3,6.9766037099815966E-3,6.9766037099815966E-3,6.9766037099815966E-3,6.9766037099815966E-3,6.9766037099815966E-3,6.9766037099815966E-3,6.9766037099815966E-3,6.9766037099815966E-3,6.9766037099815966E-3,6.9766037099815966E-3,6.9766037099815966E-3,6.9766037099815966E-3,1.7146800954750713E-2,1.7146800954750713E-2,1.7146800954750713E-2,1.7146800954750713E-2,1.7146800954750713E-2,1.7146800954750713E-2,1.7146800954750713E-2,1.7146800954750713E-2,1.7146800954750713E-2,1.7146800954750713E-2,1.7146800954750713E-2,1.7146800954750713E-2,1.7146800954750713E-2,1.7146800954750713E-2,1.7146800954750713E-2,1.7146800954750713E-2,1.7146800954750713E-2,1.7146800954750713E-2,1.7146800954750713E-2,1.7146800954750713E-2,1.7146800954750713E-2,1.7146800954750713E-2,1.7146800954750713E-2,1.7146800954750713E-2,1.7146800954750713E-2,1.7146800954750713E-2,1.7146800954750713E-2,1.7146800954750713E-2]
["f2",0.36809999999999998,null,null,null,null,null,"γ","[]",{"$f":"1-EXP(-1*J33^(J35*J29))","v":0.62374085928415424},{"$f":"1-EXP(-1*K33^(K35*K29))","v":0.62374085928415424},0.62374085928415424,0.62500934752728843,0.62508420651778374,0.62508420651778374,0.62508420651778374,0.6271892452083736,0.62606266138323452,0.62606266138323452,0.62606266138323452,0.62844661828384363,0.62725174812616036,0.62725174812616036,0.62725174812616036,0.62991463844873219,0.69313727257405033,0.69313727257405033,0.69313727257405033,0.70024898853791229,0.7247694956098123,0.7247694956098123,0.7247694956098123,0.73369905432364291,0.75836536657051212,0.75836536657051212,0.75836536657051212,0.76887629572091098,0.7927735725586279,0.7927735725586279,0.7927735725586279,0.80452531950290473,0.8268980778542977,0.8268980778542977,0.8268980778542977,0.83944588647994445,0.85967421607968508,0.85967421607968508,0.85967421607968508,0.87248518119945606,0.88523000092302739,0.88523000092302739,0.88523000092302739,0.89781378198330453]
["m",2.7143000000000002,null,null,null,null,null,"m","[]",{"$f":"HLOOKUP(J27,$B$25:$D$31,4.1)","v":2.5480720959916847},{"$f":"HLOOKUP(K27,$B$25:$D$31,4.1)","v":2.5480720959916847},2.5480720959916847,2.5480720959916847,2.5480720959916847,2.5480720959916847,2.5480720959916847,2.5480720959916847,2.5480720959916847,2.5480720959916847,2.5480720959916847,2.5480720959916847,2.5480720959916847,2.5480720959916847,2.5480720959916847,2.5480720959916847,2.5927556853433948,2.5927556853433948,2.5927556853433948,2.5927556853433948,2.5927556853433948,2.5927556853433948,2.5927556853433948,2.5927556853433948,2.5927556853433948,2.5927556853433948,2.5927556853433948,2.5927556853433948,2.5927556853433948,2.5927556853433948,2.5927556853433948,2.5927556853433948,2.5927556853433948,2.5927556853433948,2.5927556853433948,2.5927556853433948,2.5927556853433948,2.5927556853433948,2.5927556853433948,2.5927556853433948,2.5927556853433948,2.5927556853433948,2.5927556853433948,2.5927556853433948]
["α",19.403199999999998,null,null,null,null,null,"f0","[]",{"$f":"HLOOKUP(J27,$B$25:$D$31,2,1)","v":1.2096634063457334},{"$f":"HLOOKUP(K27,$B$25:$D$31,2,1)","v":1.2096634063457334},1.2096634063457334,1.2096634063457334,1.2096634063457334,1.2096634063457334,1.2096634063457334,1.2096634063457334,1.2096634063457334,1.2096634063457334,1.2096634063457334,1.2096634063457334,1.2096634063457334,1.2096634063457334,1.2096634063457334,1.2096634063457334,1.0987539721486828,1.0987539721486828,1.0987539721486828,1.0987539721486828,1.0987539721486828,1.0987539721486828,1.0987539721486828,1.0987539721486828,1.0987539721486828,1.0987539721486828,1.0987539721486828,1.0987539721486828,1.0987539721486828,1.0987539721486828,1.0987539721486828,1.0987539721486828,1.0987539721486828,1.0987539721486828,1.0987539721486828,1.0987539721486828,1.0987539721486828,1.0987539721486828,1.0987539721486828,1.0987539721486828,1.0987539721486828,1.0987539721486828,1.0987539721486828,1.0987539721486828]
["β",8.5006000000000004,null,null,null,null,null,"β","[]",{"$f":"HLOOKUP(J27,$B$25:$D$31,6,1)","v":1.5930874938891053},{"$f":"HLOOKUP(K27,$B$25:$D$31,6,1)","v":1.5930874938891053},1.5930874938891053,1.5930874938891053,1.5930874938891053,1.5930874938891053,1.5930874938891053,1.5930874938891053,1.5930874938891053,1.5930874938891053,1.5930874938891053,1.5930874938891053,1.5930874938891053,1.5930874938891053,1.5930874938891053,1.5930874938891053,0.96918249928262645,0.96918249928262645,0.96918249928262645,0.96918249928262645,0.96918249928262645,0.96918249928262645,0.96918249928262645,0.96918249928262645,0.96918249928262645,0.96918249928262645,0.96918249928262645,0.96918249928262645,0.96918249928262645,0.96918249928262645,0.96918249928262645,0.96918249928262645,0.96918249928262645,0.96918249928262645,0.96918249928262645,0.96918249928262645,0.96918249928262645,0.96918249928262645,0.96918249928262645,0.96918249928262645,0.96918249928262645,0.96918249928262645,0.96918249928262645,0.96918249928262645]
["δ",0.32740000000000002,null,null,null,null,null,"C max","[W/°C]",{"$f":"MAX(J17,J24)","v":186.29764512807276},{"$f":"MAX(K17,K24)","v":154.9362133005624},121.94837346449538,116.22763083333332,186.29764512807276,154.9362133005624,121.94837346449538,116.22763083333332,186.29764512807276,154.9362133005624,121.94837346449538,116.22763083333332,186.29764512807276,154.9362133005624,121.94837346449538,116.22763083333332,186.29764512807276,154.9362133005624,121.94837346449538,116.22763083333332,186.29764512807276,154.9362133005624,121.94837346449538,116.22763083333332,186.29764512807276,154.9362133005624,121.94837346449538,116.22763083333332,186.29764512807276,154.9362133005624,121.94837346449538,116.22763083333332,186.29764512807276,154.9362133005624,121.94837346449538,116.22763083333332,186.29764512807276,154.9362133005624,121.94837346449538,116.22763083333332,186.29764512807276,154.9362133005624,121.94837346449538,116.22763083333332]
[null,null,null,null,null,null,null,"C","[W/°C]",{"$f":"J25/J40","v":0.62388137409590505},{"$f":"K25/K40","v":0.75016439576887106},0.95308881563043057,0.85623426312623929,0.62388137409590505,0.75016439576887106,0.95308881563043057,0.85623426312623929,0.62388137409590505,0.75016439576887106,0.95308881563043057,0.85623426312623929,0.62388137409590505,0.75016439576887106,0.95308881563043057,0.85623426312623929,0.62388137409590505,0.75016439576887106,0.95308881563043057,0.85623426312623929,0.62388137409590505,0.75016439576887106,0.95308881563043057,0.85623426312623929,0.62388137409590505,0.75016439576887106,0.95308881563043057,0.85623426312623929,0.62388137409590505,0.75016439576887106,0.95308881563043057,0.85623426312623929,0.62388137409590505,0.75016439576887106,0.95308881563043057,0.85623426312623929,0.62388137409590505,0.75016439576887106,0.95308881563043057,0.85623426312623929,0.62388137409590505,0.75016439576887106,0.95308881563043057,0.85623426312623929]
["cooling","C",null,null,null,null,null,"ε","[]",{"$f":"J38*((J33/(1+J37*J33)-J36)*J41+J36)*(1-EXP(-1*J39*J29))","v":0.42256746536276762},{"$f":"K38*((K33/(1+K37*K33)-K36)*K41+K36)*(1-EXP(-1*K39*K29))","v":0.35633163537772439},0.24989715831420053,0.31658253629790062,0.46279234912554812,0.40344780160976762,0.30808693902467071,0.36880641144755605,0.47200489211794361,0.41426285421044279,0.32147706726318476,0.38052674868954878,0.48007044057306397,0.4236623958312532,0.33302020495622087,0.39059049299456167,0.52564253675638517,0.47800384195428802,0.40145313563121537,0.44360127346087486,0.54414729670264783,0.49311540659189401,0.41111216848454646,0.45529888273134439,0.56142996909574272,0.5064103197169153,0.41799914390502796,0.4649117832678058,0.57803285553257755,0.51871940804119943,0.42340852014253272,0.47338808111988728,0.59390968204508199,0.53022023908899085,0.42787755602712846,0.48101914760999054,0.60882908523883017,0.54086996113649888,0.43166631958539137,0.48787345580974256,0.62031933513932347,0.5490022873597048,0.43440279207366234,0.49297855835136978]
["cooling & heating","CH",null,null,null,null,null,"Pw","[W]",{"$f":"J42*J17*($B$3-$B$6)","v":865.95656075304271},{"$f":"K42*K17*($B$3-$B$6)","v":607.29541691083466},335.22007188797875,346.5625473608668,948.38837307916367,687.59542110439327,413.27771209685136,403.73196490539505,967.26739879553224,706.02749736693841,431.2396600476971,416.56220493699078,983.79591831794028,722.04712060732174,446.72399557746417,427.57897453874733,1077.185634545471,814.66115737069686,538.52212603692988,485.60981645071479,1115.1069597636099,840.4157719926676,551.47906283967222,498.41517619737903,1150.5238926154989,863.07427044592589,560.71747279646661,508.93840763143334,1184.5477577161214,884.05262932154005,567.97378376629979,518.21740138187374,1217.0837270213733,903.65347665743786,573.96869199418984,526.57112130848952,1247.6576735202002,921.80378033162629,579.0510610812787,534.07452480598147,1271.2043450025449,935.66369046545867,582.72185314000353,539.66307483168453]
[null,null,null,null,null,null,null,"ΔT battery","°C",{"$f":"J43/((($B$7/3600)*($B$18/1000))*$B$20)","v":7.4505223460572507},{"$f":"K43/((($B$7/3600)*($B$18/1000))*$B$20)","v":5.2250520169483332},2.8841685017969048,2.9817569615423571,8.1597496763839388,5.9159376834445059,3.5557613033468627,3.4736315453623385,8.3221811531421679,6.074523693762278,3.710302420825224,3.5840204429042135,8.4643893303535691,6.2123534260344169,3.8435266414236038,3.6788065924864437,9.267896341190335,7.009186641160178,4.6333399569088112,4.1780927045399689,9.5941640706987936,7.2307743517356613,4.7448189289040519,4.2882675369343994,9.8988844938714529,7.425723679109888,4.8243044169119935,{"$f":"AK43/((($B$7/3600)*($B$18/1000))*$B$20)","v":4.3788073798151714},10.191619232217892,7.6062174113248764,4.8867363095506597,4.4586420429147413,10.471552403633108,7.7748593013415865,4.9383153375744397,4.530515829437971,10.734604711243756,7.931020994942787,4.98204305576545,4.5950736582751741,10.93719570714997,8.050268974398783,5.0136258388989088,4.643156459117229]
[null,"C  ","CH   [C]","CH   [H]",null,null,null,"Δθ","°C",{"$f":"$B$3-J46","v":7.274738826971376},{"$f":"$B$3-K46","v":8.3874739915258338},9.5579157491015483,9.5091215192288221,6.9201251618080306,8.0420311582777479,9.2221193483265687,9.2631842273188312,6.8389094234289161,7.9627381531188597,9.1448487895873889,9.2079897785478941,6.7678053348232154,7.8938232869827907,9.0782366792881977,9.1605967037567773,6.3660518294048316,7.4954066794199115,8.6833300215455935,8.9109536477300146,6.2029179646506023,7.3846128241321694,8.6275905355479736,8.8558662315328007,6.0505577530642753,7.2871381604450569,8.5878477915440037,8.8105963100924143,5.9041903838910557,7.1968912943375614,8.5566318452246719,8.7706789785426302,5.7642237981834441,7.1125703493292072,8.5308423312127815,8.7347420852810131,5.6326976443781227,7.0344895025286078,8.5089784721172741,8.7024631708624121,5.531402146425016,6.9748655128006085,8.4931870805505447,8.6784217704413855]
["length","kv value","kv value","kv value",null,null,null,"Tw average","°C",{"$f":"$B$6+(J44/2)","v":17.725261173028624},{"$f":"$B$6+(K44/2)","v":16.612526008474166},15.442084250898452,15.490878480771178,18.079874838191969,16.957968841722252,15.777880651673431,15.736815772681169,18.161090576571084,17.03726184688114,15.855151210412611,15.792010221452106,18.232194665176785,17.106176713017209,15.921763320711802,15.839403296243223,18.633948170595168,17.504593320580089,16.316669978454406,16.089046352269985,18.797082035349398,17.615387175867831,16.372409464452026,16.144133768467199,18.949442246935725,17.712861839554943,16.412152208455996,16.189403689907586,19.095809616108944,17.803108705662439,16.443368154775328,16.22932102145737,19.235776201816556,17.887429650670793,16.469157668787219,16.265257914718987,19.367302355621877,17.965510497471392,16.491021527882726,16.297536829137588,19.468597853574984,18.025134487199391,16.506812919449455,16.321578229558614]
[600,52.886680296297193,46.576677747856621,3.9287578900455764,null,null,null,"pressure drop battery","kPa",{"$f":"(((1000*(J49^2))/2)*J50)/1000","v":1.7866520162073416},{"$f":"(((1000*(K49^2))/2)*K50)/1000","v":1.7866520162073416},{"$f":"(((1000*(L49^2))/2)*L50)/1000","v":1.7866520162073416},1.7866520162073416,2.492523494566615,2.492523494566615,2.492523494566615,2.492523494566615,2.9233454518054995,2.9233454518054995,2.9233454518054995,2.9233454518054995,3.1814787827157143,3.1814787827157143,3.1814787827157143,3.1814787827157143,0.38028712973602552,0.38028712973602552,0.38028712973602552,0.38028712973602552,0.47716206457995974,0.47716206457995974,0.47716206457995974,0.47716206457995974,0.57920032115274711,0.57920032115274711,0.57920032115274711,0.57920032115274711,0.69204662104362702,0.69204662104362702,0.69204662104362702,0.69204662104362702,0.78585329212730681,0.78585329212730681,0.78585329212730681,0.78585329212730681,0.95706532310849757,0.95706532310849757,0.95706532310849757,0.95706532310849757,1.0597725363471082,1.0597725363471082,1.0597725363471082,1.0597725363471082]
[900,74.446990218018257,64.97821765641352,6.0561247901790054,null,null,null,"Pt","[W]",{"$f":"J43+J18","v":1007.9587830921733},{"$f":"K43+K18","v":749.2976392499653},477.22229422710939,488.56476969999744,1090.3905954182942,829.59764344352391,555.279934435982,545.73418724452563,1109.2696211346629,848.02971970606905,573.24188238682768,558.56442727612148,1125.7981406570709,864.04934294645238,588.72621791659481,569.58119687787803,1219.1878568846016,956.6633797098275,680.52434837606052,627.61203878984543,1257.1091821027405,982.41799433179824,693.48128517880286,640.41739853650961,1292.5261149546295,1005.0764927850565,702.71969513559725,650.94062997056403,1326.549980055252,1026.0548516606707,709.97600610543043,660.21962372100438,1359.0859493605039,1045.6556989965684,715.97091433332048,668.57334364762016,1389.6598958593308,1063.8060026707569,721.05328342040934,676.07674714511211,1413.2065673416755,1077.6659128045894,724.72407547913417,681.66529717081517]
[1000,87.318399138929536,76.209422886636531,6.9638128144664382,null,null,null,"v water","m/s",{"$f":"((($B$7/1000)/3600)/'instelwaarden & data'!$B$55)/J27","v":0.27698147961102904},{"$f":"((($B$7/1000)/3600)/'instelwaarden & data'!$B$55)/K27","v":0.27698147961102904},{"$f":"((($B$7/1000)/3600)/'instelwaarden & data'!$B$55)/L27","v":0.27698147961102904},{"$f":"((($B$7/1000)/3600)/'instelwaarden & data'!$B$55)/M27","v":0.27698147961102904},{"$f":"((($B$7/1000)/3600)/'instelwaarden & data'!$B$55)/N27","v":0.27698147961102904},{"$f":"((($B$7/1000)/3600)/'instelwaarden & data'!$B$55)/O27","v":0.27698147961102904},{"$f":"((($B$7/1000)/3600)/'instelwaarden & data'!$B$55)/P27","v":0.27698147961102904},{"$f":"((($B$7/1000)/3600)/'instelwaarden & data'!$B$55)/Q27","v":0.27698147961102904},{"$f":"((($B$7/1000)/3600)/'instelwaarden & data'!$B$55)/R27","v":0.27698147961102904},{"$f":"((($B$7/1000)/3600)/'instelwaarden & data'!$B$55)/S27","v":0.27698147961102904},{"$f":"((($B$7/1000)/3600)/'instelwaarden & data'!$B$55)/T27","v":0.27698147961102904},{"$f":"((($B$7/1000)/3600)/'instelwaarden & data'!$B$55)/U27","v":0.27698147961102904},{"$f":"((($B$7/1000)/3600)/'instelwaarden & data'!$B$55)/V27","v":0.27698147961102904},{"$f":"((($B$7/1000)/3600)/'instelwaarden & data'!$B$55)/W27","v":0.27698147961102904},{"$f":"((($B$7/1000)/3600)/'instelwaarden & data'!$B$55)/X27","v":0.27698147961102904},{"$f":"((($B$7/1000)/3600)/'instelwaarden & data'!$B$55)/Y27","v":0.27698147961102904},{"$f":"((($B$7/1000)/3600)/'instelwaarden & data'!$B$55)/Z27","v":0.13849073980551452},{"$f":"((($B$7/1000)/3600)/'instelwaarden & data'!$B$55)/AA27","v":0.13849073980551452},{"$f":"((($B$7/1000)/3600)/'instelwaarden & data'!$B$55)/AB27","v":0.13849073980551452},{"$f":"((($B$7/1000)/3600)/'instelwaarden & data'!$B$55)/AC27","v":0.13849073980551452},{"$f":"((($B$7/1000)/3600)/'instelwaarden & data'!$B$55)/AD27","v":0.13849073980551452},{"$f":"((($B$7/1000)/3600)/'instelwaarden & data'!$B$55)/AE27","v":0.13849073980551452},{"$f":"((($B$7/1000)/3600)/'instelwaarden & data'!$B$55)/AF27","v":0.13849073980551452},{"$f":"((($B$7/1000)/3600)/'instelwaarden & data'!$B$55)/AG27","v":0.13849073980551452},{"$f":"((($B$7/1000)/3600)/'instelwaarden & data'!$B$55)/AH27","v":0.13849073980551452},{"$f":"((($B$7/1000)/3600)/'instelwaarden & data'!$B$55)/AI27","v":0.13849073980551452},{"$f":"((($B$7/1000)/3600)/'instelwaarden & data'!$B$55)/AJ27","v":0.13849073980551452},{"$f":"((($B$7/1000)/3600)/'instelwaarden & data'!$B$55)/AK27","v":0.13849073980551452},{"$f":"((($B$7/1000)/3600)/'instelwaarden & data'!$B$55)/AL27","v":0.13849073980551452},{"$f":"((($B$7/1000)/3600)/'instelwaarden & data'!$B$55)/AM27","v":0.13849073980551452},{"$f":"((($B$7/1000)/3600)/'instelwaarden & data'!$B$55)/AN27","v":0.13849073980551452},{"$f":"((($B$7/1000)/3600)/'instelwaarden & data'!$B$55)/AO27","v":0.13849073980551452},{"$f":"((($B$7/1000)/3600)/'instelwaarden & data'!$B$55)/AP27","v":0.13849073980551452},{"$f":"((($B$7/1000)/3600)/'instelwaarden & data'!$B$55)/AQ27","v":0.13849073980551452},{"$f":"((($B$7/1000)/3600)/'instelwaarden & data'!$B$55)/AR27","v":0.13849073980551452},{"$f":"((($B$7/1000)/3600)/'instelwaarden & data'!$B$55)/AS27","v":0.13849073980551452},{"$f":"((($B$7/1000)/3600)/'instelwaarden & data'!$B$55)/AT27","v":0.13849073980551452},{"$f":"((($B$7/1000)/3600)/'instelwaarden & data'!$B$55)/AU27","v":0.13849073980551452},{"$f":"((($B$7/1000)/3600)/'instelwaarden & data'!$B$55)/AV27","v":0.13849073980551452},{"$f":"((($B$7/1000)/3600)/'instelwaarden & data'!$B$55)/AW27","v":0.13849073980551452},{"$f":"((($B$7/1000)/3600)/'instelwaarden & data'!$B$55)/AX27","v":0.13849073980551452},{"$f":"((($B$7/1000)/3600)/'instelwaarden & data'!$B$55)/AY27","v":0.13849073980551452},{"$f":"((($B$7/1000)/3600)/'instelwaarden & data'!$B$55)/AZ27","v":0.13849073980551452},{"$f":"((($B$7/1000)/3600)/'instelwaarden & data'!$B$55)/BA27","v":0.13849073980551452}]
[1100,94.273319261908554,82.938765176417164,7.656796498235602,null,null,null,"kv value","[]",{"$f":"IF(OR(J28=\"C\",J28=\"E\"),VLOOKUP(J7,$A$47:$D$57,2.1),VLOOKUP(J7,$A$47:$D$57,3.1))","v":46.576677747856621},{"$f":"IF(OR(K28=\"C\",K28=\"E\"),VLOOKUP(K7,$A$47:$D$57,2.1),VLOOKUP(K7,$A$47:$D$57,3.1))","v":46.576677747856621},46.576677747856621,46.576677747856621,64.97821765641352,64.97821765641352,64.97821765641352,64.97821765641352,76.209422886636531,76.209422886636531,76.209422886636531,76.209422886636531,82.938765176417164,82.938765176417164,82.938765176417164,82.938765176417164,39.655200750220764,39.655200750220764,39.655200750220764,39.655200750220764,49.757028260311344,49.757028260311344,49.757028260311344,49.757028260311344,60.397271466557036,60.397271466557036,60.397271466557036,60.397271466557036,72.164544998003436,72.164544998003436,72.164544998003436,72.164544998003436,81.946423170202991,81.946423170202991,81.946423170202991,81.946423170202991,99.799899999999994,99.799899999999994,99.799899999999994,99.799899999999994,110.5099,110.5099,110.5099,110.5099]
[1200,47.655610988901806,39.655200750220764,8.3503531237958679,null,null,null,"ΔT battery possible","[yes/no]",{"$f":"IF(($B$6+J44)<=$B$3,\"yes\",\"no\")","v":"yes"},{"$f":"IF(($B$6+K44)<=$B$3,\"yes\",\"no\")","v":"yes"},"yes","yes","yes","yes","yes","yes","yes","yes","yes","yes","yes","yes","yes","yes","yes","yes","yes","yes","yes","yes","yes","yes","yes","yes","yes","yes","yes","yes","yes","yes","yes","yes","yes","yes","yes","yes","yes","yes","yes","yes","yes","yes"]
[1500,58.515183152537652,49.757028260311344,10.864079031585728]
[1800,71.485718679838982,60.397271466557036,13.694432329669976,null,null,"heating capacity 4 pipe system","Qair sec effectief","[m³/s]",{"$f":"J67*J10*$B$36","v":5.7950780241624283E-2},4.8195319067387075E-2,3.7933938384493229E-2,3.0956646666133496E-2,5.7950780241624283E-2,4.8195319067387075E-2,3.7933938384493229E-2,3.0956646666133496E-2,5.7950780241624283E-2,4.8195319067387075E-2,3.7933938384493229E-2,3.0956646666133496E-2,5.7950780241624283E-2,4.8195319067387075E-2,3.7933938384493229E-2,3.0956646666133496E-2,5.7950780241624283E-2,4.8195319067387075E-2,3.7933938384493229E-2,3.0956646666133496E-2,5.7950780241624283E-2,4.8195319067387075E-2,3.7933938384493229E-2,3.0956646666133496E-2,5.7950780241624283E-2,4.8195319067387075E-2,3.7933938384493229E-2,3.0956646666133496E-2,5.7950780241624283E-2,4.8195319067387075E-2,3.7933938384493229E-2,3.0956646666133496E-2,5.7950780241624283E-2,4.8195319067387075E-2,3.7933938384493229E-2,3.0956646666133496E-2,5.7950780241624283E-2,4.8195319067387075E-2,3.7933938384493229E-2,3.0956646666133496E-2,5.7950780241624283E-2,4.8195319067387075E-2,3.7933938384493229E-2,3.0956646666133496E-2]
[2100,82.670742499330487,72.164544998003436,16.635147345288019,null,null,null,"no tubes","[]",2,2,2,2,2,2,2,2,2,2,2,2,2,2,2,2,2,2,2,2,2,2,2,2,2,2,2,2,2,2,2,2,2,2,2,2,2,2,2,2,2,2,2,2]
[2400,97.156369885206615,81.946423170202991,21.855360547508166,null,null,null,"no rows","[]",1,1,1,1,1,1,1,1,1,1,1,1,1,1,1,1,1,1,1,1,1,1,1,1,1,1,1,1,1,1,1,1,1,1,1,1,1,1,1,1,1,1,1,1]
[2700,108.57250000000001,99.799899999999994,24.0412,null,null,null,"L'","[]",{"$f":"J19*(J54/J55)","v":0.91},{"$f":"K19*(K54/K55)","v":0.91},0.91,0.91,1.51,1.51,1.51,1.51,1.71,1.71,1.71,1.71,1.91,1.91,1.91,1.91,2.11,2.11,2.11,2.11,2.71,2.71,2.71,2.71,3.31,3.31,3.31,3.31,3.91,3.91,3.91,3.91,4.51,4.51,4.51,4.51,5.1100000000000003,5.1100000000000003,5.1100000000000003,5.1100000000000003,5.61,5.61,5.61,5.61]
[2950,120.9025,110.5099,27.311200000000003,null,null,null,"NTU","[m.°C/W]",{"$f":"($B$38*J56)/J62","v":0.25322047533162151},0.30447612761116244,0.38683892955921123,0.47402822007449902,0.42017903049532795,0.50522961834379698,0.64189756443341639,0.7865742992444984,0.47583188221656347,0.57214744858800848,0.72691710939148479,0.89075632563449814,0.53148473393779894,0.63906527883222009,0.8119366543495532,0.99493835202449787,0.5871375856590344,0.70598310907643158,0.8969561993076216,1.0991203784144976,0.7540961408227409,0.90673659980906618,1.1520148341818268,1.411666457584497,0.92105469598644751,1.1074900905417009,1.4070734690560323,1.7242125367544965,1.0880132511501539,1.3082435812743354,1.6621321039302375,2.0367586159244961,1.2549718063138602,1.5089970720069696,1.9171907388044422,2.3493046950944949,1.4219303614775669,1.7097505627396046,2.1722493736786479,2.6618507742644946,1.5610624907806556,1.8770451383501334,2.3847982360738187,2.9223058402394941]
[null,null,null,null,null,null,null,"γ","[]",{"$f":"1-EXP(-1*J57^($B$40*J56))","v":0.48530162242555375},0.50424333734864035,0.52930667345844662,0.5509367956632798,0.47867518613290971,0.51008851722270121,0.55210026346963348,0.58855869450759046,0.48305216621624725,0.51883402663251565,0.56676400747370526,0.60831072774591566,0.4900812173910335,0.53036028120413858,0.58432502568493816,0.63095318428665581,0.49953470329393168,0.54443717176355477,0.60450917860838005,0.65612169476016347,0.54089578136255867,0.60020396948725596,0.67818561189345616,0.74278568620666463,0.59937809089040894,0.67273792261942433,0.7649298807819811,0.83546731297354082,0.67176630309993501,0.75598190425591727,0.85286124721976619,0.91674958730817491,0.75301527440823601,0.84052848092750532,0.92679016212348764,0.97068190736008808,0.8350401376027311,0.91396598150374064,0.97430509832679135,0.99416827351906745,0.89627257808342453,0.95837405245400165,0.99280819551069632,0.99922922428637395]
[null,null,null,null,null,null,null,"Pw","[w]",{"$f":"IF($B$8=\"H\",J66*J60*($C$6-$C$3),0)","v":515.49481545618528},{"$f":"IF($B$8=\"H\",K66*K60*($C$6-$C$3),0)","v":507.77377579409125},471.57126047997605,429.28386026937676,562.22186549921389,547.95856262446614,509.79251000878116,468.11633257889167,577.95743565777536,563.03188699845282,525.33496318269317,484.23977361818959,594.04420265555711,579.07399740219034,542.25408382674459,501.801021452052,610.59109753472467,596.12269141361014,560.49660683544062,520.66026358345812,663.79148048141622,653.41875986681282,622.23412602443216,583.03635622277545,723.24581713003283,719.20354072096427,690.94805061231875,647.85143308246052,788.72691882350216,790.40199766826595,758.98778080334534,704.20115060932358,857.83218017551769,860.77583395082252,815.90084682501492,741.87429003505633,925.51311705657827,921.49239593328525,853.03434512815011,759.01598548740071,975.64524772232039,958.70115898405072,868.35148663549899,763.48050089406308]
[null,null,null,null,null,null,null,"Ca","[W/°C]",{"$f":"J53*$C$19*$C$21","v":69.72940074011089},{"$f":"K53*$C$19*$C$21","v":57.991121138236245},45.644092801413244,37.248651561767801,69.72940074011089,57.991121138236245,45.644092801413244,37.248651561767801,69.72940074011089,57.991121138236245,45.644092801413244,37.248651561767801,69.72940074011089,57.991121138236245,45.644092801413244,37.248651561767801,69.72940074011089,57.991121138236245,45.644092801413244,37.248651561767801,69.72940074011089,57.991121138236245,45.644092801413244,37.248651561767801,69.72940074011089,57.991121138236245,45.644092801413244,37.248651561767801,69.72940074011089,57.991121138236245,45.644092801413244,37.248651561767801,69.72940074011089,57.991121138236245,45.644092801413244,37.248651561767801,69.72940074011089,57.991121138236245,45.644092801413244,37.248651561767801,69.72940074011089,57.991121138236245,45.644092801413244,37.248651561767801]
[null,null,null,null,null,null,null,"Cw","[W/°C]",{"$f":"J65*$C$18*$C$20","v":114.97554444444444},{"$f":"K65*$C$18*$C$20","v":114.97554444444444},114.97554444444444,114.97554444444444,114.97554444444444,114.97554444444444,114.97554444444444,114.97554444444444,114.97554444444444,114.97554444444444,114.97554444444444,114.97554444444444,114.97554444444444,114.97554444444444,114.97554444444444,114.97554444444444,114.97554444444444,114.97554444444444,114.97554444444444,114.97554444444444,114.97554444444444,114.97554444444444,114.97554444444444,114.97554444444444,114.97554444444444,114.97554444444444,114.97554444444444,114.97554444444444,114.97554444444444,114.97554444444444,114.97554444444444,114.97554444444444,114.97554444444444,114.97554444444444,114.97554444444444,114.97554444444444,114.97554444444444,114.97554444444444,114.97554444444444,114.97554444444444,114.97554444444444,114.97554444444444,114.97554444444444,114.97554444444444]
[null,null,null,null,null,null,null,"Cmin","[W/°C]",{"$f":"MIN(J60:J61)","v":69.72940074011089},{"$f":"MIN(K60:K61)","v":57.991121138236245},45.644092801413244,37.248651561767801,69.72940074011089,57.991121138236245,45.644092801413244,37.248651561767801,69.72940074011089,57.991121138236245,45.644092801413244,37.248651561767801,69.72940074011089,57.991121138236245,45.644092801413244,37.248651561767801,69.72940074011089,57.991121138236245,45.644092801413244,37.248651561767801,69.72940074011089,57.991121138236245,45.644092801413244,37.248651561767801,69.72940074011089,57.991121138236245,45.644092801413244,37.248651561767801,69.72940074011089,57.991121138236245,45.644092801413244,37.248651561767801,69.72940074011089,57.991121138236245,45.644092801413244,37.248651561767801,69.72940074011089,57.991121138236245,45.644092801413244,37.248651561767801,69.72940074011089,57.991121138236245,45.644092801413244,37.248651561767801]
[null,null,null,null,null,null,null,"Cmax","[W/°C]",{"$f":"MAX(J60:J61)","v":114.97554444444444},{"$f":"MAX(K60:K61)","v":114.97554444444444},114.97554444444444,114.97554444444444,114.97554444444444,114.97554444444444,114.97554444444444,114.97554444444444,114.97554444444444,114.97554444444444,114.97554444444444,114.97554444444444,114.97554444444444,114.97554444444444,114.97554444444444,114.97554444444444,114.97554444444444,114.97554444444444,114.97554444444444,114.97554444444444,114.97554444444444,114.97554444444444,114.97554444444444,114.97554444444444,114.97554444444444,114.97554444444444,114.97554444444444,114.97554444444444,114.97554444444444,114.97554444444444,114.97554444444444,114.97554444444444,114.97554444444444,114.97554444444444,114.97554444444444,114.97554444444444,114.97554444444444,114.97554444444444,114.97554444444444,114.97554444444444,114.97554444444444,114.97554444444444,114.97554444444444,114.97554444444444]
[null,null,null,null,null,null,null,"C","[W/°C]",{"$f":"J62/J63","v":0.60647158556229985},{"$f":"K62/K63","v":0.50437787808221457},0.39698957740937879,0.32397021246345259,0.60647158556229985,0.50437787808221457,0.39698957740937879,0.32397021246345259,0.60647158556229985,0.50437787808221457,0.39698957740937879,0.32397021246345259,0.60647158556229985,0.50437787808221457,0.39698957740937879,0.32397021246345259,0.60647158556229985,0.50437787808221457,0.39698957740937879,0.32397021246345259,0.60647158556229985,0.50437787808221457,0.39698957740937879,0.32397021246345259,0.60647158556229985,0.50437787808221457,0.39698957740937879,0.32397021246345259,0.60647158556229985,0.50437787808221457,0.39698957740937879,0.32397021246345259,0.60647158556229985,0.50437787808221457,0.39698957740937879,0.32397021246345259,0.60647158556229985,0.50437787808221457,0.39698957740937879,0.32397021246345259,0.60647158556229985,0.50437787808221457,0.39698957740937879,0.32397021246345259]
[null,null,null,null,null,null,null,"Qw","[m³/s]",{"$f":"($C$7/3600)/1000","v":2.7777777777777776E-5},{"$f":"($C$7/3600)/1000","v":2.7777777777777776E-5},2.7777777777777776E-5,2.7777777777777776E-5,2.7777777777777776E-5,2.7777777777777776E-5,2.7777777777777776E-5,2.7777777777777776E-5,2.7777777777777776E-5,2.7777777777777776E-5,2.7777777777777776E-5,2.7777777777777776E-5,2.7777777777777776E-5,2.7777777777777776E-5,2.7777777777777776E-5,2.7777777777777776E-5,2.7777777777777776E-5,2.7777777777777776E-5,2.7777777777777776E-5,2.7777777777777776E-5,2.7777777777777776E-5,2.7777777777777776E-5,2.7777777777777776E-5,2.7777777777777776E-5,2.7777777777777776E-5,2.7777777777777776E-5,2.7777777777777776E-5,2.7777777777777776E-5,2.7777777777777776E-5,2.7777777777777776E-5,2.7777777777777776E-5,2.7777777777777776E-5,2.7777777777777776E-5,2.7777777777777776E-5,2.7777777777777776E-5,2.7777777777777776E-5,2.7777777777777776E-5,2.7777777777777776E-5,2.7777777777777776E-5,2.7777777777777776E-5,2.7777777777777776E-5,2.7777777777777776E-5,2.7777777777777776E-5,2.7777777777777776E-5]
[null,null,null,null,null,null,null,"ε","[]",{"$f":"$B$35*((J57/(1+$B$37*J57)-J58)*J64+J58)*(1-EXP(-1*$B$39*J56))","v":0.29571159940266278},0.35024242734241079,0.41325940031861047,0.46099264512436289,0.3225163902352618,0.37796031659279067,0.44675442425969031,0.50269345380477459,0.33154303896107523,0.38835730432341625,0.46037498474845595,0.52000784277003542,0.3407711503901345,0.39942252264571576,0.47520198172058326,0.53886624123285365,0.35026321239183711,0.41118204284590643,0.49118873653511319,0.5591185095332325,0.38078140551096357,0.45070262277511547,0.54529213997669057,0.62610197338924001,0.41488715488931227,0.4960783834522281,0.60550928560983508,0.69570457551533849,0.45245013463584677,0.545188285485391,0.66513560394815896,0.75621652981620324,0.49209209949917804,0.59372939653913526,0.71501111907278636,0.79667237221174447,0.53091700615989346,0.63560929869707405,0.74755289701079408,0.81508022831780402,0.5596751082709901,0.66127444351265319,0.76097600661140796,0.81987451237317077]
[null,null,null,null,null,null,null,"Q air primair","[m³/s]",{"$f":"$C$4/3600","v":2.4E-2},{"$f":"$C$4/3600","v":2.4E-2},2.4E-2,2.4E-2,2.4E-2,2.4E-2,2.4E-2,2.4E-2,2.4E-2,2.4E-2,2.4E-2,2.4E-2,2.4E-2,2.4E-2,2.4E-2,2.4E-2,2.4E-2,2.4E-2,2.4E-2,2.4E-2,2.4E-2,2.4E-2,2.4E-2,2.4E-2,2.4E-2,2.4E-2,2.4E-2,2.4E-2,2.4E-2,2.4E-2,2.4E-2,2.4E-2,2.4E-2,2.4E-2,2.4E-2,2.4E-2,2.4E-2,2.4E-2,2.4E-2,2.4E-2,2.4E-2,2.4E-2,2.4E-2,2.4E-2]
[null,null,null,null,null,null,null,"ΔT battery","°C",{"$f":"J59/((($C$7/3600)*($C$18/1000))*$C$20)","v":4.483517063972414},{"$f":"K59/((($C$7/3600)*($C$18/1000))*$C$20)","v":4.4163633079332341},{"$f":"L59/((($C$7/3600)*($C$18/1000))*$C$20)","v":4.1014918673234613},3.7336971296257215,4.889925663895216,4.7658705620588453,4.4339212523156188,4.0714426258279905,5.0267858130216663,4.8969708273093397,4.5691017661284672,4.2116762826217506,5.1667004972748449,5.0364971107572858,4.7162558476838425,4.3644152665397424,5.3106171445855512,5.1847781569032136,4.8749202236330316,4.5284435581432563,5.7733275688218786,5.6831108130350385,5.4118824053500552,5.0709597335674763,6.2904317663788172,6.2552740602022503,6.0095218852925818,5.6346889785375085,6.8599537635119505,6.8745227647100551,6.6012975582827886,6.1247907458232547,7.4609968956486883,7.4865993295360713,7.0962990500928118,6.4524529422300407,8.0496519631944974,8.0146817341538696,7.4192677168868002,6.6015428685719613,8.4856762578214795,8.3383050162227317,7.5524885820834857,6.6403729991726435]
[null,null,null,null,null,null,null,"Δθ","°C",{"$f":"IF($B$8=\"H\",ABS($C$3-J70),0)","v":22.758241468013793},{"$f":"IF($B$8=\"H\",ABS($C$3-K70),0)","v":22.791818346033381},22.94925406633827,23.133151435187138,22.555037168052394,22.617064718970575,22.783039373842193,22.964278687086008,22.48660709348917,22.551514586345327,22.715449116935766,22.894161858689124,22.416649751362577,22.481751444621359,22.64187207615808,22.817792366730131,22.344691427707225,22.407610921548397,22.562539888183487,22.735778220928374,22.113336215589058,22.158444593482479,22.294058797324972,22.464520133216261,21.854784116810592,21.872362969898873,21.995239057353707,22.182655510731244,21.570023118244023,21.562738617644975,21.699351220858603,21.937604627088376,21.269501552175655,21.256700335231962,21.451850474953595,21.773773528884981,20.975174018402754,20.992659132923066,21.290366141556603,21.699228565714023,20.757161871089259,20.830847491888633,21.223755708958258,21.67981350041368]
[null,null,null,null,null,null,null,"Tw average","°C",{"$f":"$C$6-(J68/2)","v":42.758241468013793},{"$f":"$C$6-(K68/2)","v":42.791818346033381},42.94925406633827,43.133151435187138,42.555037168052394,42.617064718970575,42.783039373842193,42.964278687086008,42.48660709348917,42.551514586345327,42.715449116935766,42.894161858689124,42.416649751362577,42.481751444621359,42.64187207615808,42.817792366730131,42.344691427707225,42.407610921548397,42.562539888183487,42.735778220928374,42.113336215589058,42.158444593482479,42.294058797324972,42.464520133216261,41.854784116810592,41.872362969898873,41.995239057353707,42.182655510731244,41.570023118244023,41.562738617644975,41.699351220858603,41.937604627088376,41.269501552175655,41.256700335231962,41.451850474953595,41.773773528884981,40.975174018402754,40.992659132923066,41.290366141556603,41.699228565714023,40.757161871089259,40.830847491888633,41.223755708958258,41.67981350041368]
[null,null,null,null,null,null,null,"pressure drop battery","kPa",{"$f":"IF($B$8=\"H\",(((1000*J74^2)/2)*J75)/1000,0)","v":0.15070467763801482},{"$f":"IF($B$8=\"H\",(((1000*K74^2)/2)*K75)/1000,0)","v":0.15070467763801482},0.15070467763801482,0.15070467763801482,0.23230913173652687,0.23230913173652687,0.23230913173652687,0.23230913173652687,0.26712747252630187,0.26712747252630187,0.26712747252630187,0.26712747252630187,0.2937098900724297,0.2937098900724297,0.2937098900724297,0.2937098900724297,0.32031428530472456,0.32031428530472456,0.32031428530472456,0.32031428530472456,0.41673922753994136,0.41673922753994136,0.41673922753994136,0.41673922753994136,0.52530979699911717,0.52530979699911717,0.52530979699911717,0.52530979699911717,0.63811377241762945,0.63811377241762945,0.63811377241762945,0.63811377241762945,0.83835786224449582,0.83835786224449582,0.83835786224449582,0.83835786224449582,0.92220528661515744,0.92220528661515744,0.92220528661515744,0.92220528661515744,1.0476404265928443,1.0476404265928443,1.0476404265928443,1.0476404265928443]
[null,null,null,null,null,null,null,"Pt","[W]",{"$f":"J59+J20","v":515.49481545618528},{"$f":"K59+K20","v":507.77377579409125},471.57126047997605,429.28386026937676,562.22186549921389,547.95856262446614,509.79251000878116,468.11633257889167,577.95743565777536,563.03188699845282,525.33496318269317,484.23977361818959,594.04420265555711,579.07399740219034,542.25408382674459,501.801021452052,610.59109753472467,596.12269141361014,560.49660683544062,520.66026358345812,663.79148048141622,653.41875986681282,622.23412602443216,583.03635622277545,723.24581713003283,719.20354072096427,690.94805061231875,647.85143308246052,788.72691882350216,790.40199766826595,758.98778080334534,704.20115060932358,857.83218017551769,860.77583395082252,815.90084682501492,741.87429003505633,925.51311705657827,921.49239593328525,853.03434512815011,759.01598548740071,975.64524772232039,958.70115898405072,868.35148663549899,763.48050089406308]
[null,null,null,null,null,null,null,"Ps","[Pa]",{"$f":"IF($B$8=\"H\",($C$4/(J14*J15))^2,0)","v":5025.6200031262979},{"$f":"IF($B$8=\"H\",($C$4/(K14*K15))^2,0)","v":3010.5069876195603},1280.5092250201239,628.04367315437946,1862.0444624059628,1115.4241390802154,474.44198129290032,232.69671065833336,1457.1324269419447,872.86888990152943,371.27190547920753,182.09550286724607,1171.2503217749756,701.61637285782865,298.43021177639031,146.36927459959375,961.93507872339296,576.22985309905653,245.0974688515081,120.21148431470543,585.97353992430385,351.01687660525516,149.30387156689133,73.228173669398174,394.00860824510187,236.02374782937358,100.39192324157771,49.238623975303348,282.97084763365547,169.50858074502551,72.099916145919067,35.362413081947246,213.02368525362343,127.60799514996408,54.2776401608876,26.621228360349996,166.13619845045619,99.520892152712733,42.330883471739625,20.761774319153037,139.60055564239718,83.625194100543354,35.569700695003441,17.445657587621646]
[null,null,null,null,null,null,null,"v water","m/s",{"$f":"(($C$7/1000)/3600)/'instelwaarden & data'!$B$55","v":0.27698147961102904},{"$f":"(($C$7/1000)/3600)/'instelwaarden & data'!$B$55","v":0.27698147961102904},{"$f":"(($C$7/1000)/3600)/'instelwaarden & data'!$B$55","v":0.27698147961102904},{"$f":"(($C$7/1000)/3600)/'instelwaarden & data'!$B$55","v":0.27698147961102904},{"$f":"(($C$7/1000)/3600)/'instelwaarden & data'!$B$55","v":0.27698147961102904},{"$f":"(($C$7/1000)/3600)/'instelwaarden & data'!$B$55","v":0.27698147961102904},{"$f":"(($C$7/1000)/3600)/'instelwaarden & data'!$B$55","v":0.27698147961102904},{"$f":"(($C$7/1000)/3600)/'instelwaarden & data'!$B$55","v":0.27698147961102904},{"$f":"(($C$7/1000)/3600)/'instelwaarden & data'!$B$55","v":0.27698147961102904},{"$f":"(($C$7/1000)/3600)/'instelwaarden & data'!$B$55","v":0.27698147961102904},{"$f":"(($C$7/1000)/3600)/'instelwaarden & data'!$B$55","v":0.27698147961102904},{"$f":"(($C$7/1000)/3600)/'instelwaarden & data'!$B$55","v":0.27698147961102904},{"$f":"(($C$7/1000)/3600)/'instelwaarden & data'!$B$55","v":0.27698147961102904},{"$f":"(($C$7/1000)/3600)/'instelwaarden & data'!$B$55","v":0.27698147961102904},{"$f":"(($C$7/1000)/3600)/'instelwaarden & data'!$B$55","v":0.27698147961102904},{"$f":"(($C$7/1000)/3600)/'instelwaarden & data'!$B$55","v":0.27698147961102904},{"$f":"(($C$7/1000)/3600)/'instelwaarden & data'!$B$55","v":0.27698147961102904},{"$f":"(($C$7/1000)/3600)/'instelwaarden & data'!$B$55","v":0.27698147961102904},{"$f":"(($C$7/1000)/3600)/'instelwaarden & data'!$B$55","v":0.27698147961102904},{"$f":"(($C$7/1000)/3600)/'instelwaarden & data'!$B$55","v":0.27698147961102904},{"$f":"(($C$7/1000)/3600)/'instelwaarden & data'!$B$55","v":0.27698147961102904},{"$f":"(($C$7/1000)/3600)/'instelwaarden & data'!$B$55","v":0.27698147961102904},{"$f":"(($C$7/1000)/3600)/'instelwaarden & data'!$B$55","v":0.27698147961102904},{"$f":"(($C$7/1000)/3600)/'instelwaarden & data'!$B$55","v":0.27698147961102904},{"$f":"(($C$7/1000)/3600)/'instelwaarden & data'!$B$55","v":0.27698147961102904},{"$f":"(($C$7/1000)/3600)/'instelwaarden & data'!$B$55","v":0.27698147961102904},{"$f":"(($C$7/1000)/3600)/'instelwaarden & data'!$B$55","v":0.27698147961102904},{"$f":"(($C$7/1000)/3600)/'instelwaarden & data'!$B$55","v":0.27698147961102904},{"$f":"(($C$7/1000)/3600)/'instelwaarden & data'!$B$55","v":0.27698147961102904},{"$f":"(($C$7/1000)/3600)/'instelwaarden & data'!$B$55","v":0.27698147961102904},{"$f":"(($C$7/1000)/3600)/'instelwaarden & data'!$B$55","v":0.27698147961102904},{"$f":"(($C$7/1000)/3600)/'instelwaarden & data'!$B$55","v":0.27698147961102904},{"$f":"(($C$7/1000)/3600)/'instelwaarden & data'!$B$55","v":0.27698147961102904},{"$f":"(($C$7/1000)/3600)/'instelwaarden & data'!$B$55","v":0.27698147961102904},{"$f":"(($C$7/1000)/3600)/'instelwaarden & data'!$B$55","v":0.27698147961102904},{"$f":"(($C$7/1000)/3600)/'instelwaarden & data'!$B$55","v":0.27698147961102904},{"$f":"(($C$7/1000)/3600)/'instelwaarden & data'!$B$55","v":0.27698147961102904},{"$f":"(($C$7/1000)/3600)/'instelwaarden & data'!$B$55","v":0.27698147961102904},{"$f":"(($C$7/1000)/3600)/'instelwaarden & data'!$B$55","v":0.27698147961102904},{"$f":"(($C$7/1000)/3600)/'instelwaarden & data'!$B$55","v":0.27698147961102904},{"$f":"(($C$7/1000)/3600)/'instelwaarden & data'!$B$55","v":0.27698147961102904},{"$f":"(($C$7/1000)/3600)/'instelwaarden & data'!$B$55","v":0.27698147961102904},{"$f":"(($C$7/1000)/3600)/'instelwaarden & data'!$B$55","v":0.27698147961102904},{"$f":"(($C$7/1000)/3600)/'instelwaarden & data'!$B$55","v":0.27698147961102904}]
[null,null,null,null,null,null,null,"kv value","[]",{"$f":"VLOOKUP(J7,$A$47:$D$57,4,1)","v":3.9287578900455764},{"$f":"VLOOKUP(K7,$A$47:$D$57,4,1)","v":3.9287578900455764},3.9287578900455764,3.9287578900455764,6.0561247901790054,6.0561247901790054,6.0561247901790054,6.0561247901790054,6.9638128144664382,6.9638128144664382,6.9638128144664382,6.9638128144664382,7.656796498235602,7.656796498235602,7.656796498235602,7.656796498235602,8.3503531237958679,8.3503531237958679,8.3503531237958679,8.3503531237958679,10.864079031585728,10.864079031585728,10.864079031585728,10.864079031585728,13.694432329669976,13.694432329669976,13.694432329669976,13.694432329669976,16.635147345288019,16.635147345288019,16.635147345288019,16.635147345288019,21.855360547508166,21.855360547508166,21.855360547508166,21.855360547508166,24.0412,24.0412,24.0412,24.0412,27.311200000000003,27.311200000000003,27.311200000000003,27.311200000000003]
[]
[]
[]
[null,null,null,null,null,null,"Heating capacity 2 pipe system","Qw","[m³/s]",{"$f":"($C$7/3600)/1000","v":2.7777777777777776E-5},{"$f":"($C$7/3600)/1000","v":2.7777777777777776E-5},2.7777777777777776E-5,2.7777777777777776E-5,2.7777777777777776E-5,2.7777777777777776E-5,2.7777777777777776E-5,2.7777777777777776E-5,2.7777777777777776E-5,2.7777777777777776E-5,2.7777777777777776E-5,2.7777777777777776E-5,2.7777777777777776E-5,2.7777777777777776E-5,2.7777777777777776E-5,2.7777777777777776E-5,2.7777777777777776E-5,2.7777777777777776E-5,2.7777777777777776E-5,2.7777777777777776E-5,2.7777777777777776E-5,2.7777777777777776E-5,2.7777777777777776E-5,2.7777777777777776E-5,2.7777777777777776E-5,2.7777777777777776E-5,2.7777777777777776E-5,2.7777777777777776E-5,2.7777777777777776E-5,2.7777777777777776E-5,2.7777777777777776E-5,2.7777777777777776E-5,2.7777777777777776E-5,2.7777777777777776E-5,2.7777777777777776E-5,2.7777777777777776E-5,2.7777777777777776E-5,2.7777777777777776E-5,2.7777777777777776E-5,2.7777777777777776E-5,2.7777777777777776E-5,2.7777777777777776E-5,2.7777777777777776E-5,2.7777777777777776E-5]
[null,null,null,null,null,null,null,"Cw","[W/°C]",{"$f":"J79*$C$18*$C$20","v":114.97554444444444},{"$f":"K79*$C$18*$C$20","v":114.97554444444444},114.97554444444444,114.97554444444444,114.97554444444444,114.97554444444444,114.97554444444444,114.97554444444444,114.97554444444444,114.97554444444444,114.97554444444444,114.97554444444444,114.97554444444444,114.97554444444444,114.97554444444444,114.97554444444444,114.97554444444444,114.97554444444444,114.97554444444444,114.97554444444444,114.97554444444444,114.97554444444444,114.97554444444444,114.97554444444444,114.97554444444444,114.97554444444444,114.97554444444444,114.97554444444444,114.97554444444444,114.97554444444444,114.97554444444444,114.97554444444444,114.97554444444444,114.97554444444444,114.97554444444444,114.97554444444444,114.97554444444444,114.97554444444444,114.97554444444444,114.97554444444444,114.97554444444444,114.97554444444444,114.97554444444444,114.97554444444444]
[null,null,null,null,null,null,null,"Cmin","[W/°C]",{"$f":"MIN(J80,J109)","v":114.97554444444444},{"$f":"MIN(K80,K109)","v":114.97554444444444},114.97554444444444,101.19166411781526,114.97554444444444,114.97554444444444,114.97554444444444,101.19166411781526,114.97554444444444,114.97554444444444,114.97554444444444,101.19166411781526,114.97554444444444,114.97554444444444,114.97554444444444,101.19166411781526,114.97554444444444,114.97554444444444,114.97554444444444,101.19166411781526,114.97554444444444,114.97554444444444,114.97554444444444,101.19166411781526,114.97554444444444,114.97554444444444,114.97554444444444,101.19166411781526,114.97554444444444,114.97554444444444,114.97554444444444,101.19166411781526,114.97554444444444,114.97554444444444,114.97554444444444,101.19166411781526,114.97554444444444,114.97554444444444,114.97554444444444,101.19166411781526,114.97554444444444,114.97554444444444,114.97554444444444,101.19166411781526]
[null,null,null,null,null,null,null,"Cmin (lucht of water)","[]"]
[null,null,null,null,null,null,null,"no circuits","[]",{"$f":"IF(J7<=1100,1,IF(J7<=3000,2,4))","v":1},{"$f":"IF(K7<=1100,1,IF(K7<=3000,2,4))","v":1},1,1,1,1,1,1,1,1,1,1,1,1,1,1,2,2,2,2,2,2,2,2,2,2,2,2,2,2,2,2,2,2,2,2,2,2,2,2,2,2,2,2]
[null,null,null,null,null,null,null,"Type battery C /CH","[]",{"$f":"IF($B$8<>\"H\",$G$1,$G$2)","v":"H"},{"$f":"IF($B$8<>\"H\",$G$1,$G$2)","v":"H"},"H","H","H","H","H","H","H","H","H","H","H","H","H","H","H","H","H","H","H","H","H","H","H","H","H","H","H","H","H","H","H","H","H","H","H","H","H","H","H","H","H","H"]
[null,null,null,null,null,null,null,"L'","[]",{"$f":"J19*(J30/J31)","v":3.1850000000000001},{"$f":"K19*(K30/K31)","v":3.1850000000000001},3.1850000000000001,3.1850000000000001,5.2850000000000001,5.2850000000000001,5.2850000000000001,5.2850000000000001,5.9849999999999994,5.9849999999999994,5.9849999999999994,5.9849999999999994,6.6849999999999996,6.6849999999999996,6.6849999999999996,6.6849999999999996,7.3849999999999998,7.3849999999999998,7.3849999999999998,7.3849999999999998,9.4849999999999994,9.4849999999999994,9.4849999999999994,9.4849999999999994,11.585000000000001,11.585000000000001,11.585000000000001,11.585000000000001,13.685,13.685,13.685,13.685,15.785,15.785,15.785,15.785,17.885000000000002,17.885000000000002,17.885000000000002,17.885000000000002,19.635000000000002,19.635000000000002,19.635000000000002,19.635000000000002]
[null,null,null,null,null,null,null,"no tubes","[]",16,16,16,16,16,16,16,16,16,16,16,16,16,16,16,16,16,16,16,16,16,16,16,16,16,16,16,16,16,16,16,16,16,16,16,16,16,16,16,16,16,16,16,16]
[null,null,null,null,null,null,null,"no rows","[]",2,2,2,2,2,2,2,2,2,2,2,2,2,2,2,2,2,2,2,2,2,2,2,2,2,2,2,2,2,2,2,2,2,2,2,2,2,2,2,2,2,2,2,2]
[null,null,null,null,null,null,null,"α","[]",{"$f":"IF(OR(J84=\"C\",J84=\"E\"),HLOOKUP(J83,$B$25:$D$31,5,1),HLOOKUP(J83,$B$25:$D$31,5,1)*HLOOKUP(J83,$B$25:$D$31,3,1))","v":13.090707012654546},{"$f":"IF(OR(K84=\"C\",K84=\"E\"),HLOOKUP(K83,$B$25:$D$31,5,1),HLOOKUP(K83,$B$25:$D$31,5,1)*HLOOKUP(K83,$B$25:$D$31,3,1))","v":13.090707012654546},13.090707012654546,13.090707012654546,13.090707012654546,13.090707012654546,13.090707012654546,13.090707012654546,13.090707012654546,13.090707012654546,13.090707012654546,13.090707012654546,13.090707012654546,13.090707012654546,13.090707012654546,13.090707012654546,58.688368329453048,58.688368329453048,58.688368329453048,58.688368329453048,58.688368329453048,58.688368329453048,58.688368329453048,58.688368329453048,58.688368329453048,58.688368329453048,58.688368329453048,58.688368329453048,58.688368329453048,58.688368329453048,58.688368329453048,58.688368329453048,58.688368329453048,58.688368329453048,58.688368329453048,58.688368329453048,58.688368329453048,58.688368329453048,58.688368329453048,58.688368329453048,58.688368329453048,58.688368329453048,58.688368329453048,58.688368329453048]
[null,null,null,null,null,null,null,"NTU","[m.°C/W]",{"$f":"(J88*J85)/J81","v":0.36263278453489728},{"$f":"(K88*K85)/K81","v":0.36263278453489728},0.36263278453489728,0.41202901640950801,0.60173132378867578,0.60173132378867578,0.60173132378867578,0.68369649975643643,0.68143083687326844,0.68143083687326844,0.68143083687326844,0.77425232753874573,0.76113034995786133,0.76113034995786133,0.76113034995786133,0.86480815532105515,3.769615549178233,3.769615549178233,3.769615549178233,4.2830958843447489,4.8415441413616165,4.8415441413616165,4.8415441413616165,5.5010378419783255,5.9134727335450012,5.9134727335450012,5.9134727335450012,6.7189797996119056,6.9854013257283851,6.9854013257283851,6.9854013257283851,7.9369217572454831,8.057329917911769,8.057329917911769,8.057329917911769,9.1548637148790597,9.129258510095152,9.129258510095152,9.129258510095152,10.372805672512639,10.02253233691464,10.02253233691464,10.02253233691464,11.387757303873954]
[null,null,null,null,null,null,null,"f1","[]",{"$f":"IF(OR(J84=\"C\",J84=\"E\"),1,HLOOKUP(J83,$B$25:$D$31,3,1))","v":0.17097714280393719},{"$f":"IF(OR(K84=\"C\",K84=\"E\"),1,HLOOKUP(K83,$B$25:$D$31,3,1))","v":0.17097714280393719},0.17097714280393719,0.17097714280393719,0.17097714280393719,0.17097714280393719,0.17097714280393719,0.17097714280393719,0.17097714280393719,0.17097714280393719,0.17097714280393719,0.17097714280393719,0.17097714280393719,0.17097714280393719,0.17097714280393719,0.17097714280393719,0.82696530173597793,0.82696530173597793,0.82696530173597793,0.82696530173597793,0.82696530173597793,0.82696530173597793,0.82696530173597793,0.82696530173597793,0.82696530173597793,0.82696530173597793,0.82696530173597793,0.82696530173597793,0.82696530173597793,0.82696530173597793,0.82696530173597793,0.82696530173597793,0.82696530173597793,0.82696530173597793,0.82696530173597793,0.82696530173597793,0.82696530173597793,0.82696530173597793,0.82696530173597793,0.82696530173597793,0.82696530173597793,0.82696530173597793,0.82696530173597793,0.82696530173597793]
[null,null,null,null,null,null,null,"δ","[]",{"$f":"HLOOKUP(J83,$B$25:$D$31,7,1)","v":6.9766037099815966E-3},{"$f":"HLOOKUP(K83,$B$25:$D$31,7,1)","v":6.9766037099815966E-3},6.9766037099815966E-3,6.9766037099815966E-3,6.9766037099815966E-3,6.9766037099815966E-3,6.9766037099815966E-3,6.9766037099815966E-3,6.9766037099815966E-3,6.9766037099815966E-3,6.9766037099815966E-3,6.9766037099815966E-3,6.9766037099815966E-3,6.9766037099815966E-3,6.9766037099815966E-3,6.9766037099815966E-3,1.7146800954750713E-2,1.7146800954750713E-2,1.7146800954750713E-2,1.7146800954750713E-2,1.7146800954750713E-2,1.7146800954750713E-2,1.7146800954750713E-2,1.7146800954750713E-2,1.7146800954750713E-2,1.7146800954750713E-2,1.7146800954750713E-2,1.7146800954750713E-2,1.7146800954750713E-2,1.7146800954750713E-2,1.7146800954750713E-2,1.7146800954750713E-2,1.7146800954750713E-2,1.7146800954750713E-2,1.7146800954750713E-2,1.7146800954750713E-2,1.7146800954750713E-2,1.7146800954750713E-2,1.7146800954750713E-2,1.7146800954750713E-2,1.7146800954750713E-2,1.7146800954750713E-2,1.7146800954750713E-2,1.7146800954750713E-2]
[null,null,null,null,null,null,null,"γ","[]",{"$f":"1-EXP(-1*J89^(J91*J85))","v":0.62382937555061035},{"$f":"1-EXP(-1*K89^(K91*K85))","v":0.62382937555061035},0.62382937555061035,0.62487304747536276,0.62523109643708197,0.62523109643708197,0.62523109643708197,0.62696305536304053,0.62622901471077497,0.62622901471077497,0.62622901471077497,0.62819045918016947,0.62743756676711149,0.62743756676711149,0.62743756676711149,0.62962850980916496,0.6936344125156082,0.6936344125156082,0.6936344125156082,0.69948616679005404,0.72539484027815182,0.72539484027815182,0.72539484027815182,0.732742953039353,0.7591034492604295,0.7591034492604295,0.7591034492604295,0.76775387661106698,0.79360193309279414,0.79360193309279414,0.79360193309279414,0.80327511884992786,0.82778711924876769,0.82778711924876769,0.82778711924876769,0.83811781404071528,0.86058808193102598,0.86058808193102598,0.86058808193102598,0.87113841630535405,0.88613409960223588,0.88613409960223588,0.88613409960223588,0.89650037166227914]
[null,null,null,null,null,null,null,"m","[]",{"$f":"HLOOKUP(J83,$B$25:$D$31,4.1)","v":2.5480720959916847},{"$f":"HLOOKUP(K83,$B$25:$D$31,4.1)","v":2.5480720959916847},2.5480720959916847,2.5480720959916847,2.5480720959916847,2.5480720959916847,2.5480720959916847,2.5480720959916847,2.5480720959916847,2.5480720959916847,2.5480720959916847,2.5480720959916847,2.5480720959916847,2.5480720959916847,2.5480720959916847,2.5480720959916847,2.5927556853433948,2.5927556853433948,2.5927556853433948,2.5927556853433948,2.5927556853433948,2.5927556853433948,2.5927556853433948,2.5927556853433948,2.5927556853433948,2.5927556853433948,2.5927556853433948,2.5927556853433948,2.5927556853433948,2.5927556853433948,2.5927556853433948,2.5927556853433948,2.5927556853433948,2.5927556853433948,2.5927556853433948,2.5927556853433948,2.5927556853433948,2.5927556853433948,2.5927556853433948,2.5927556853433948,2.5927556853433948,2.5927556853433948,2.5927556853433948,2.5927556853433948]
[null,null,null,null,null,null,null,"f0","[]",{"$f":"HLOOKUP(J83,$B$25:$D$31,2,1)","v":1.2096634063457334},{"$f":"HLOOKUP(K83,$B$25:$D$31,2,1)","v":1.2096634063457334},1.2096634063457334,1.2096634063457334,1.2096634063457334,1.2096634063457334,1.2096634063457334,1.2096634063457334,1.2096634063457334,1.2096634063457334,1.2096634063457334,1.2096634063457334,1.2096634063457334,1.2096634063457334,1.2096634063457334,1.2096634063457334,1.0987539721486828,1.0987539721486828,1.0987539721486828,1.0987539721486828,1.0987539721486828,1.0987539721486828,1.0987539721486828,1.0987539721486828,1.0987539721486828,1.0987539721486828,1.0987539721486828,1.0987539721486828,1.0987539721486828,1.0987539721486828,1.0987539721486828,1.0987539721486828,1.0987539721486828,1.0987539721486828,1.0987539721486828,1.0987539721486828,1.0987539721486828,1.0987539721486828,1.0987539721486828,1.0987539721486828,1.0987539721486828,1.0987539721486828,1.0987539721486828,1.0987539721486828]
[null,null,null,null,null,null,null,"β","[]",{"$f":"HLOOKUP(J83,$B$25:$D$31,6,1)","v":1.5930874938891053},{"$f":"HLOOKUP(K83,$B$25:$D$31,6,1)","v":1.5930874938891053},1.5930874938891053,1.5930874938891053,1.5930874938891053,1.5930874938891053,1.5930874938891053,1.5930874938891053,1.5930874938891053,1.5930874938891053,1.5930874938891053,1.5930874938891053,1.5930874938891053,1.5930874938891053,1.5930874938891053,1.5930874938891053,0.96918249928262645,0.96918249928262645,0.96918249928262645,0.96918249928262645,0.96918249928262645,0.96918249928262645,0.96918249928262645,0.96918249928262645,0.96918249928262645,0.96918249928262645,0.96918249928262645,0.96918249928262645,0.96918249928262645,0.96918249928262645,0.96918249928262645,0.96918249928262645,0.96918249928262645,0.96918249928262645,0.96918249928262645,0.96918249928262645,0.96918249928262645,0.96918249928262645,0.96918249928262645,0.96918249928262645,0.96918249928262645,0.96918249928262645,0.96918249928262645,0.96918249928262645]
[null,null,null,null,null,null,null,"C max","[W/°C]",{"$f":"MAX(J73,J80)","v":5025.6200031262979},{"$f":"MAX(K73,K80)","v":3010.5069876195603},1280.5092250201239,628.04367315437946,1862.0444624059628,1115.4241390802154,474.44198129290032,232.69671065833336,1457.1324269419447,872.86888990152943,371.27190547920753,182.09550286724607,1171.2503217749756,701.61637285782865,298.43021177639031,146.36927459959375,961.93507872339296,576.22985309905653,245.0974688515081,120.21148431470543,585.97353992430385,351.01687660525516,149.30387156689133,114.97554444444444,394.00860824510187,236.02374782937358,114.97554444444444,114.97554444444444,282.97084763365547,169.50858074502551,114.97554444444444,114.97554444444444,213.02368525362343,127.60799514996408,114.97554444444444,114.97554444444444,166.13619845045619,114.97554444444444,114.97554444444444,114.97554444444444,139.60055564239718,114.97554444444444,114.97554444444444,114.97554444444444]
[null,null,null,null,null,null,null,"C","[W/°C]",{"$f":"J81/J96","v":2.2877882604120759E-2},{"$f":"K81/K96","v":3.8191422546857069E-2},8.9788923186115685E-2,0.16112201817044869,6.1746938252958579E-2,0.10307787003718055,0.24233847125232247,0.43486503883758865,7.8905350206049121E-2,0.13172143694732336,0.3096801636419092,0.55570655246542522,9.8164792194212008E-2,0.16387237939748364,0.38526777754858832,0.69134498612932338,0.11952526421744722,0.19953069738766141,0.46910131297235952,0.84178033982928302,0.19621286049758663,0.32754990459829963,0.77007744834622682,0.88011467661899645,0.29180972709337694,0.4871354916690952,1,0.88011467661899645,0.40631586400481801,0.67828745860004835,1,0.88011467661899645,0.53973127123190989,0.90100580539115849,1,0.88011467661899645,0.69205594877465271,1,1,0.88011467661899645,0.82360377374834715,1,1,0.88011467661899645]
[null,null,null,null,null,null,null,"ε","[]",{"$f":"J94*((J89/(1+J93*J89)-J92)*J97+J92)*(1-EXP(-1*J95*J85))","v":0.7379287731281069},{"$f":"K94*((K89/(1+K93*K89)-K92)*K97+K92)*(1-EXP(-1*K95*K85))","v":0.7299146725850082},0.70291193125662199,0.6690591007148825,0.7272004245603606,0.70782113960537762,0.64252450201588307,0.55964189304903111,0.72147096468589955,0.69737361168787626,0.6161798974082644,0.51265420246952986,0.71521349400151735,0.6859244563376945,0.5872378596896618,0.46082990008776087,0.7164315232367231,0.68623783791996351,0.58450311797547094,0.44851102564170897,0.71758531548905402,0.66446221030817243,0.48546901449716123,0.44501181116575556,0.7067603555385138,0.62155317848659797,0.39782571959289437,0.45385201350314075,0.68085374569536006,0.55292698691093478,0.40160367411112896,0.46149931784560666,0.63690799526306718,0.45442292767237424,0.40441950759650008,0.46829617934726081,0.57257435307832283,0.40660050295031802,0.40660050295031802,0.47435283202552203,0.50783895002989621,0.40807478904414546,0.40807478904414546,0.47884630823546559]
[null,null,null,null,null,null,null,"Pw","[W]",{"$f":"J98*J109*($C$6-$C$3)","v":3494.6570999122619},{"$f":"K98*K109*($C$6-$C$3)","v":2874.8010186398574},2179.0123214817891,1692.5800948626982,3443.8501645305741,2787.7846679611439,1991.8125507467262,1415.7773616918962,3416.7167902022202,2746.6366200761313,1910.1448261116623,1296.9082966220781,3387.0828808725014,2701.5436185247272,1820.4251130248717,1165.8036116281767,3392.8511808354756,2702.7778856600066,1811.9474707679835,1134.6394264968162,3398.3152695568569,2617.0136192448681,1504.9438162129218,1125.7871430986443,3347.0508053904027,2448.0145115099212,1233.2514305818443,1148.1510127400995,3224.3631947159279,2177.7272397821234,1244.9630107658852,1167.4970990508375,3016.2464572316671,1789.7646730943102,1253.6920358215498,1184.6917422041049,2711.5774598823778,1601.4139514710457,1260.4530759145352,1200.0138112915267,2405.0058175816212,1607.220492048305,1265.0233320461905,1211.3813696754769]
[null,null,null,null,null,null,null,"ΔT battery","°C",{"$f":"J99/((($C$7/3600)*($C$18/1000))*$C$20)","v":30.394786272143822},{"$f":"K99/((($C$7/3600)*($C$18/1000))*$C$20)","v":25.003586915206526},18.951963498069592,14.721218351616884,29.952892862313202,24.246762052152633,17.323793162894386,12.313726093082275,29.716900291375957,23.888876833310334,16.613487984261155,11.279862190595994,29.459159312866934,23.49668037301705,15.833150621908917,10.139578962302602,29.509329111938957,23.507415413596711,15.759416313470965,9.8685284073176778,29.556853033202245,22.761480555627156,13.089251488085822,9.7915356568945722,29.110980265961512,21.291610518902903,10.726206486264953,9.9860454524299289,28.043904556363486,18.940786497726823,10.828067975511475,10.154308072139338,26.233808866102837,15.56648139169382,10.903988686283865,10.303858511203151,23.583949725870596,13.928300659144435,10.962792844382479,10.437122234036186,20.917542327827,13.978803056026452,11.002542655124742,10.535991593071428]
[null,null,null,null,null,null,null,"Δθ","°C",{"$f":"ABS($C$3-J102)","v":40.197393136071909},{"$f":"ABS($C$3-K102)","v":37.501793457603263},34.475981749034794,32.360609175808442,39.976446431156603,37.123381026076316,33.661896581447195,31.15686304654114,39.858450145687982,36.944438416655167,33.306743992130578,30.639931095297996,39.729579656433465,36.748340186508528,32.916575310954457,30.069789481151304,39.754664555969477,36.753707706798352,32.879708156735482,29.934264203658842,39.778426516601122,36.38074027781358,31.544625744042911,29.895767828447283,39.555490132980758,35.64580525945145,30.363103243132478,29.993022726214967,39.021952278181743,34.470393248863409,30.414033987755737,30.077154036069672,38.116904433051417,32.783240695846914,30.451994343141934,30.151929255601573,36.791974862935298,31.96415032957222,30.481396422191239,30.218561117018091,35.458771163913497,31.989401528013225,30.501271327562371,30.267995796535715]
[null,null,null,null,null,null,null,"Tw average","°C",{"$f":"$C$6+(J100/2)","v":60.197393136071909},{"$f":"$C$6+(K100/2)","v":57.501793457603263},54.475981749034794,52.360609175808442,59.976446431156603,57.123381026076316,53.661896581447195,51.15686304654114,59.858450145687982,56.944438416655167,53.306743992130578,50.639931095297996,59.729579656433465,56.748340186508528,52.916575310954457,50.069789481151304,59.754664555969477,56.753707706798352,52.879708156735482,49.934264203658842,59.778426516601122,56.38074027781358,51.544625744042911,49.895767828447283,59.555490132980758,55.64580525945145,50.363103243132478,49.993022726214967,59.021952278181743,54.470393248863409,50.414033987755737,50.077154036069672,58.116904433051417,52.783240695846914,50.451994343141934,50.151929255601573,56.791974862935298,51.96415032957222,50.481396422191239,50.218561117018091,55.458771163913497,51.989401528013225,50.501271327562371,50.267995796535715]
[null,null,null,null,null,null,null,"pressure drop battery","kPa",{"$f":"(((1000*(J105^2))/2)*J106)/1000","v":1.7866520162073416},{"$f":"(((1000*(K105^2))/2)*K106)/1000","v":1.7866520162073416},{"$f":"(((1000*(L105^2))/2)*L106)/1000","v":1.7866520162073416},1.7866520162073416,2.492523494566615,2.492523494566615,2.492523494566615,2.492523494566615,2.9233454518054995,2.9233454518054995,2.9233454518054995,2.9233454518054995,3.1814787827157143,3.1814787827157143,3.1814787827157143,3.1814787827157143,0.38028712973602552,0.38028712973602552,0.38028712973602552,0.38028712973602552,0.47716206457995974,0.47716206457995974,0.47716206457995974,0.47716206457995974,0.57920032115274711,0.57920032115274711,0.57920032115274711,0.57920032115274711,0.69204662104362702,0.69204662104362702,0.69204662104362702,0.69204662104362702,0.78585329212730681,0.78585329212730681,0.78585329212730681,0.78585329212730681,0.95706532310849757,0.95706532310849757,0.95706532310849757,0.95706532310849757,1.0597725363471082,1.0597725363471082,1.0597725363471082,1.0597725363471082]
[null,null,null,null,null,null,null,"Pt","[W]",{"$f":"J108+J99","v":3494.6570999122619},{"$f":"K108+K99","v":2874.8010186398574},2179.0123214817891,1692.5800948626982,3443.8501645305741,2787.7846679611439,1991.8125507467262,1415.7773616918962,3416.7167902022202,2746.6366200761313,1910.1448261116623,1296.9082966220781,3387.0828808725014,2701.5436185247272,1820.4251130248717,1165.8036116281767,3392.8511808354756,2702.7778856600066,1811.9474707679835,1134.6394264968162,3398.3152695568569,2617.0136192448681,1504.9438162129218,1125.7871430986443,3347.0508053904027,2448.0145115099212,1233.2514305818443,1148.1510127400995,3224.3631947159279,2177.7272397821234,1244.9630107658852,1167.4970990508375,3016.2464572316671,1789.7646730943102,1253.6920358215498,1184.6917422041049,2711.5774598823778,1601.4139514710457,1260.4530759145352,1200.0138112915267,2405.0058175816212,1607.220492048305,1265.0233320461905,1211.3813696754769]
[null,null,null,null,null,null,null,"v water","m/s",{"$f":"((($C$7/1000)/3600)/'instelwaarden & data'!$B$55)/J83","v":0.27698147961102904},{"$f":"((($C$7/1000)/3600)/'instelwaarden & data'!$B$55)/K83","v":0.27698147961102904},{"$f":"((($C$7/1000)/3600)/'instelwaarden & data'!$B$55)/L83","v":0.27698147961102904},{"$f":"((($C$7/1000)/3600)/'instelwaarden & data'!$B$55)/M83","v":0.27698147961102904},{"$f":"((($C$7/1000)/3600)/'instelwaarden & data'!$B$55)/N83","v":0.27698147961102904},{"$f":"((($C$7/1000)/3600)/'instelwaarden & data'!$B$55)/O83","v":0.27698147961102904},{"$f":"((($C$7/1000)/3600)/'instelwaarden & data'!$B$55)/P83","v":0.27698147961102904},{"$f":"((($C$7/1000)/3600)/'instelwaarden & data'!$B$55)/Q83","v":0.27698147961102904},{"$f":"((($C$7/1000)/3600)/'instelwaarden & data'!$B$55)/R83","v":0.27698147961102904},{"$f":"((($C$7/1000)/3600)/'instelwaarden & data'!$B$55)/S83","v":0.27698147961102904},{"$f":"((($C$7/1000)/3600)/'instelwaarden & data'!$B$55)/T83","v":0.27698147961102904},{"$f":"((($C$7/1000)/3600)/'instelwaarden & data'!$B$55)/U83","v":0.27698147961102904},{"$f":"((($C$7/1000)/3600)/'instelwaarden & data'!$B$55)/V83","v":0.27698147961102904},{"$f":"((($C$7/1000)/3600)/'instelwaarden & data'!$B$55)/W83","v":0.27698147961102904},{"$f":"((($C$7/1000)/3600)/'instelwaarden & data'!$B$55)/X83","v":0.27698147961102904},{"$f":"((($C$7/1000)/3600)/'instelwaarden & data'!$B$55)/Y83","v":0.27698147961102904},{"$f":"((($C$7/1000)/3600)/'instelwaarden & data'!$B$55)/Z83","v":0.13849073980551452},{"$f":"((($C$7/1000)/3600)/'instelwaarden & data'!$B$55)/AA83","v":0.13849073980551452},{"$f":"((($C$7/1000)/3600)/'instelwaarden & data'!$B$55)/AB83","v":0.13849073980551452},{"$f":"((($C$7/1000)/3600)/'instelwaarden & data'!$B$55)/AC83","v":0.13849073980551452},{"$f":"((($C$7/1000)/3600)/'instelwaarden & data'!$B$55)/AD83","v":0.13849073980551452},{"$f":"((($C$7/1000)/3600)/'instelwaarden & data'!$B$55)/AE83","v":0.13849073980551452},{"$f":"((($C$7/1000)/3600)/'instelwaarden & data'!$B$55)/AF83","v":0.13849073980551452},{"$f":"((($C$7/1000)/3600)/'instelwaarden & data'!$B$55)/AG83","v":0.13849073980551452},{"$f":"((($C$7/1000)/3600)/'instelwaarden & data'!$B$55)/AH83","v":0.13849073980551452},{"$f":"((($C$7/1000)/3600)/'instelwaarden & data'!$B$55)/AI83","v":0.13849073980551452},{"$f":"((($C$7/1000)/3600)/'instelwaarden & data'!$B$55)/AJ83","v":0.13849073980551452},{"$f":"((($C$7/1000)/3600)/'instelwaarden & data'!$B$55)/AK83","v":0.13849073980551452},{"$f":"((($C$7/1000)/3600)/'instelwaarden & data'!$B$55)/AL83","v":0.13849073980551452},{"$f":"((($C$7/1000)/3600)/'instelwaarden & data'!$B$55)/AM83","v":0.13849073980551452},{"$f":"((($C$7/1000)/3600)/'instelwaarden & data'!$B$55)/AN83","v":0.13849073980551452},{"$f":"((($C$7/1000)/3600)/'instelwaarden & data'!$B$55)/AO83","v":0.13849073980551452},{"$f":"((($C$7/1000)/3600)/'instelwaarden & data'!$B$55)/AP83","v":0.13849073980551452},{"$f":"((($C$7/1000)/3600)/'instelwaarden & data'!$B$55)/AQ83","v":0.13849073980551452},{"$f":"((($C$7/1000)/3600)/'instelwaarden & data'!$B$55)/AR83","v":0.13849073980551452},{"$f":"((($C$7/1000)/3600)/'instelwaarden & data'!$B$55)/AS83","v":0.13849073980551452},{"$f":"((($C$7/1000)/3600)/'instelwaarden & data'!$B$55)/AT83","v":0.13849073980551452},{"$f":"((($C$7/1000)/3600)/'instelwaarden & data'!$B$55)/AU83","v":0.13849073980551452},{"$f":"((($C$7/1000)/3600)/'instelwaarden & data'!$B$55)/AV83","v":0.13849073980551452},{"$f":"((($C$7/1000)/3600)/'instelwaarden & data'!$B$55)/AW83","v":0.13849073980551452},{"$f":"((($C$7/1000)/3600)/'instelwaarden & data'!$B$55)/AX83","v":0.13849073980551452},{"$f":"((($C$7/1000)/3600)/'instelwaarden & data'!$B$55)/AY83","v":0.13849073980551452},{"$f":"((($C$7/1000)/3600)/'instelwaarden & data'!$B$55)/AZ83","v":0.13849073980551452},{"$f":"((($C$7/1000)/3600)/'instelwaarden & data'!$B$55)/BA83","v":0.13849073980551452}]
[null,null,null,null,null,null,null,"kv value","[]",{"$f":"IF(OR(J28=\"C\",J28=\"E\"),VLOOKUP(J7,$A$47:$D$57,2.1),VLOOKUP(J7,$A$47:$D$57,3.1))","v":46.576677747856621},{"$f":"IF(OR(K28=\"C\",K28=\"E\"),VLOOKUP(K7,$A$47:$D$57,2.1),VLOOKUP(K7,$A$47:$D$57,3.1))","v":46.576677747856621},46.576677747856621,46.576677747856621,64.97821765641352,64.97821765641352,64.97821765641352,64.97821765641352,76.209422886636531,76.209422886636531,76.209422886636531,76.209422886636531,82.938765176417164,82.938765176417164,82.938765176417164,82.938765176417164,39.655200750220764,39.655200750220764,39.655200750220764,39.655200750220764,49.757028260311344,49.757028260311344,49.757028260311344,49.757028260311344,60.397271466557036,60.397271466557036,60.397271466557036,60.397271466557036,72.164544998003436,72.164544998003436,72.164544998003436,72.164544998003436,81.946423170202991,81.946423170202991,81.946423170202991,81.946423170202991,99.799899999999994,99.799899999999994,99.799899999999994,99.799899999999994,110.5099,110.5099,110.5099,110.5099]
[null,null,null,null,null,null,null,"ΔT battery possible","[yes/no]",{"$f":"IF(($B$6+J100)<=$B$3,\"yes\",\"no\")","v":"no"},{"$f":"IF(($B$6+K100)<=$B$3,\"yes\",\"no\")","v":"no"},"no","no","no","no","no","no","no","no","no","no","no","no","no","yes","no","no","no","yes","no","no","no","yes","no","no","yes","yes","no","no","yes","yes","no","no","yes","yes","no","no","yes","yes","no","no","no","yes"]
[null,null,null,null,null,null,null,"Pa","[w]",{"$f":"IF($B$8<>\"H\",($C$4/3600)*$C$19,0)*$C$21*($C$5-$C$3)","v":0},{"$f":"IF($B$8<>\"H\",($C$4/3600)*$C$19,0)*$C$21*($C$5-$C$3)","v":0},0,0,0,0,0,0,0,0,0,0,0,0,0,0,0,0,0,0,0,0,0,0,0,0,0,0,0,0,0,0,0,0,0,0,0,0,0,0,0,0,0,0]
[null,null,null,null,null,null,null,"Ca","[W/°C]",{"$f":"J12*$C$19*$C$21","v":189.43059152434367},{"$f":"K12*$C$19*$C$21","v":157.54175805008489},123.99916544801208,101.19166411781526,189.43059152434367,157.54175805008489,123.99916544801208,101.19166411781526,189.43059152434367,157.54175805008489,123.99916544801208,101.19166411781526,189.43059152434367,157.54175805008489,123.99916544801208,101.19166411781526,189.43059152434367,157.54175805008489,123.99916544801208,101.19166411781526,189.43059152434367,157.54175805008489,123.99916544801208,101.19166411781526,189.43059152434367,157.54175805008489,123.99916544801208,101.19166411781526,189.43059152434367,157.54175805008489,123.99916544801208,101.19166411781526,189.43059152434367,157.54175805008489,123.99916544801208,101.19166411781526,189.43059152434367,157.54175805008489,123.99916544801208,101.19166411781526,189.43059152434367,157.54175805008489,123.99916544801208,101.19166411781526]

{"sheet":"info","index":11,"n_rows":22,"n_cols":3,"rows_kept":22,"cut":false,"hidden":false,"merged":[]}
[{"$f":"'general info'!A15","v":"Used abbreviation"},{"$f":"'general info'!B15","v":"Unit"},{"$f":"'general info'!C15","v":"Meaning"}]
[{"$f":"'general info'!A16","v":"Tr"},{"$f":"'general info'!B16","v":"ºC"},{"$f":"'general info'!C16","v":"Room Air Temperature (Tr):"}]
[{"$f":"'general info'!A17","v":"Qp"},{"$f":"'general info'!B17","v":"m3/h"},{"$f":"'general info'!C17","v":"Supply (Primary) Air Flow Rate:"}]
[{"$f":"'general info'!A18","v":"Tp"},{"$f":"'general info'!B18","v":"ºC"},{"$f":"'general info'!C18","v":"Supply (Primary) Air Temperature (Tp):"}]
[{"$f":"'general info'!A19","v":"Twin"},{"$f":"'general info'!B19","v":"ºC"},{"$f":"'general info'!C19","v":"Water Inlet Temperature  (Twin):"}]
[{"$f":"'general info'!A20","v":"Qw"},{"$f":"'general info'!B20","v":"l/h"},{"$f":"'general info'!C20","v":"Water Flow Rate :"}]
[{"$f":"'general info'!A21","v":"type batt"},{"$f":"'general info'!B21","v":"C/H/E"},{"$f":"'general info'!C21","v":"Type of battery (cooling/cooling & heating):"}]
[{"$f":"'general info'!A22","v":"x"},{"$f":"'general info'!B22","v":"m"},{"$f":"'general info'!C22","v":"Distance to wall:"}]
[{"$f":"'general info'!A23","v":"y"},{"$f":"'general info'!B23","v":"m"},{"$f":"'general info'!C23","v":"Distance between chilled beams :"}]
[{"$f":"'general info'!A24","v":"Pt"},{"$f":"'general info'!B24","v":"W"},{"$f":"'general info'!C24","v":"Total Capacity:"}]
[{"$f":"'general info'!A25","v":"Ps"},{"$f":"'general info'!B25","v":"Pa"},{"$f":"'general info'!C25","v":"Plenum static pressure:"}]
[{"$f":"'general info'!A26","v":"LwA"},{"$f":"'general info'!B26","v":"dB(A)"},{"$f":"'general info'!C26","v":"Sound Power Pw:"}]
[{"$f":"'general info'!A27","v":"Pb"},{"$f":"'general info'!B27","v":"kPa"},{"$f":"'general info'!C27","v":"Water pressure drop:"}]
[{"$f":"'general info'!A28","v":"Pw"},{"$f":"'general info'!B28","v":"W"},{"$f":"'general info'!C28","v":"Water capacity:"}]
[{"$f":"'general info'!A29","v":"Pa"},{"$f":"'general info'!B29","v":"W"},{"$f":"'general info'!C29","v":"Air capacity:"}]
[{"$f":"'general info'!A30","v":"V1"},{"$f":"'general info'!B30","v":"m/s"},{"$f":"'general info'!C30","v":"v1 (0,5m from wall @ 1,8m height):"}]
[{"$f":"'general info'!A31","v":"V2"},{"$f":"'general info'!B31","v":"m/s"},{"$f":"'general info'!C31","v":"v2 (0,5m from wall @ 0,1 m height):"}]
[{"$f":"'general info'!A32","v":"V3"},{"$f":"'general info'!B32","v":"m/s"},{"$f":"'general info'!C32","v":"v3 (between 2 chilled beams @ 1,8m height):"}]
[{"$f":"'general info'!A33","v":"ΔT c"},{"$f":"'general info'!B33","v":"°C"},{"$f":"'general info'!C33","v":"ΔT battery cooling:"}]
[{"$f":"'general info'!A34","v":"Δθ c"},{"$f":"'general info'!B34","v":"°C"},{"$f":"'general info'!C34","v":"Temp. diff. air-water mean Dq: cooling:"}]
[{"$f":"'general info'!A35","v":"ΔT h"},{"$f":"'general info'!B35","v":"°C"},{"$f":"'general info'!C35","v":"ΔT battery heating:"}]
[{"$f":"'general info'!A36","v":"Δθ h"},{"$f":"'general info'!B36","v":"°C"},{"$f":"'general info'!C36","v":"Temp. diff. air-water mean Dq: heating:"}]